Producto de
sub property of: causativeRelationship
comment: ع <هو نتاج> س مع عنصر معالجة. ع يتم إنتاجها أو تصنيعها كنتيجة أو عاقبة لـ س. على سبيل المثال: "نفايات قطع الأخشاب" <هو نتاج> "قطع الجذور" @ar
comment: Y<是...的产品>X，其中有加工处理的要素。Y的生产或制造是X的结果或后果。例如：“砍伐损失”<是...的产品>“森林采运”。但是，“蜂蜜” <由...生产>“蜜蜂”。 @zh
comment: Y является продуктом X, Y <является продуктом> X, с элементом обработки. Y производится или изготавливается как результат или следствие X. Например, "ферментированные продукты" <является продуктом> "брожение". Однако "мед" <производится> "медоносные пчелы". @ru
comment: Y <producto de> X, con un elemento de transformación. Y se produce o fabrica como resultado o consecuencia de X. Ej. “Residuos de explotación forestal” <producto de> “Aprovechamiento de la madera”. Pero, “Miel” <es producido por> “Abeja melífera”.
comment: Y <product of> X, with a processing element. Y is produced or manufactured as a result or consequence of X. E.g. “logging wastes” <product of> “logging”. However, “honey” <is produced by> “honey bees”. @en
comment: Y <est le produit de> X, avec un élément de traitement. Y est produit ou fabriqué à la suite de X. Par exemple, "déchet d'exploitation forestière" <est le produit de> "exploitation forestière". Cependant, "miel" <est produit par> "abeille domestique". @fr
label: 是...的产品 @zh
label: هو نتاج @ar
label: является продуктом @ru
label: Product of @en
label: Est le produit de @fr

Es objeto de la actividad
sub property of: processRelationship
comment: ع <هو هدف النشاط> س . ع هو محور النشاط س. على سبيل المثال "الصوف" <هو محور> "الجز" ، "المعاهدات" <هي محور > "التصديق". @ar
comment: Y <является объектом деятельности> X. Y является центром деятельности X. Например, "шерсть" <является объектом деятельности> "стрижка", "пакты" <является объектом деятельности> "ратификация". @ru
comment: Y <is object of activity> X. Y is the focus of activity X. E.g. “wool” <is object of activity> "shearing”, “treaties" <is object of activity> “ratification”. @en
comment: Y <est l'objet de l'activité> X. Y est le centre de l'activité X. Par exemple, “laine" <est l'objet de l'activité> "tonte", “traité” <est l'objet de l'activité> “ratification”. @fr
comment: Y <es objeto de la actividad> X. La actividad Y tiene como foco el concepto X. Ej. “Lana” <es objeto de la actividad> "Esquileo”, “Tratado" <es objeto de la actividad> “Ratificación”.
comment: X<是活动...的对象>Y。概念X是活动Y关注的对象。例如：“羊毛”<是活动...的对象>“剪毛”，“条约”<是活动...的对象>“批准”。 @zh
label: 是活动...的对象 @zh
label: هو محور النشاط @ar
label: является объектом деятельности @ru
label: Is object of activity @en
label: Est l'objet de l'activité @fr

Es producido por
sub property of: causativeRelationship
comment: س <يُنتج من قبل> ع. تقييد الاستخدام للعمليات الطبيعية (مثل الفاكهة التي تنمو على النباتات والبيض والحليب) - ولكن أيضًا العمليات الكيميائية على سبيل المثال: "العسل" <يُنتج من قبل> "نحل العسل" البطاطا <يُنتج من قبل> "Solanum tuberosum" ومع ذلك ، "الجبن" <هو نتاج> "صناعة الجبن". @ar
comment: X<由...生产>Y。限用于自然过程（如长在植物上的水果，蛋类，牛奶），也可用于化学过程。例如：“蜂蜜”<由...生产>“蜜蜂”，“马铃薯”<由...生产>“阳芋”。但是，“奶酪制作”<有产品>“干酪”。 @zh
comment: X <производится> Y. Ограничьте использование естественными процессами (такими, как растущие на растениях плоды, яйца, молоко), а также химическими процессами. Например, "мед" <производится> "медоносные пчелы", "картофель (клубни)" <производится> "Solanum tuberosum". Однако "сыры" <является продуктом> " сыроделие". @ru
comment: X <is produced by> Y. Restrict use to natural processes (such as fruits growing on plants, eggs, milk) - but also chemical processes. E.g. “honey” <is produced by> “honey bees”, “potatoes” <is produced by> “Solanum tuberosum". However, “cheese-making” <has product>” cheese”. @en
comment: X <est produit par> Y. Restreindre l'utilisation aux processus naturels (tels que les fruits poussant sur les plantes, les œufs, le lait) - mais aussi les processus chimiques. Par exemple, "miel" <est produit par> "abeille domestique", "pomme de terre" <est produit par> "Solanum tuberosum". Cependant, "fabrication fromagère" <a le produit> "fromage". @fr
comment: X <es producido por> Y. Restringir el uso a los procesos naturales (como los frutos que crecen en las plantas, los huevos, la leche), pero también a los procesos químicos. Ej. “Miel” <es producido por> “Abeja melífera”, “Papa” <es producido por> “Solanum tuberosum". Pero “Fabricación del queso” <tiene el producto> ”Queso”.
label: 由...生产 @zh
label: من إنتاج @ar
label: производится @ru
label: Is produced by @en
label: Est produit par @fr

Es utilizado en
sub property of: processRelationship
comment: س <يستخدم في> ع. يتم استخدام س عادة في ع ، ومن الطبيعي استخدام س في ممارسة ع "القطارات" تستخدم في "النقل بالسكك الحديدية" @ar
comment: X<被用于>Y。 X习惯性地被用于Y中，在做法Y中通常使用X。例如：“信息素”<被用于>“信息素诱捕器”，“火车”<被用于>“铁路运输”。 @zh
comment: X <используется в> Y. X обычно используется в Y, нормально использовать X при обращении с Y. Например, "экструдеры" <используется в> "экструзия", "фильтры" <используется в> "сепараторы". @ru
comment: X <is used in> Y. X is habitually used in Y, it is normal to use X in the practice of Y. E.g. “pheromones” <is used in> “pheromone traps”, “trains” <is used in> “rail transport”. @en
comment: X <est utilisé dans> Y. X est habituellement utilisé dans Y, il est normal d'utiliser X dans la pratique de Y. Par exemple, "phéromone" <est utilisé dans> "piège à base de phéromones", "train" <est utilisé dans> "transport ferroviaire". @fr
comment: X <es utilizado en> Y. X se usa habitualmente en Y, es normal usar X en la práctica de Y. Ej. "Feromona" <es utilizado en> "Trampa de feromonas", "Trenes" <es utilizado en> "Transporte por ferrocarriles".
label: 被用于 @zh
label: يستخدم في @ar
label: используется в @ru
label: Is used in @en
label: Est utilisé dans @fr

Es fuente de
sub property of: causativeRelationship
comment: ع <هو مصدر> س. على سبيل المثال: " اللوز" <هو مصدر> "زيت اللوز" "البرتقال الحلو" <هو مصدر> " عصير البرتقال" تستخدم لربط كائن حي بمنتج مشتق: "الخروف" <هو مصدر> "لحم الضأن" @ar
comment: Y<是...的来源>X。例如：“杏仁”<是...的来源>“杏仁油”，“甜橙”<是...的来源>“橙汁”。用于表示生物体及其衍生产品的关系：“绵羊”<是...的来源>“羊肉”。 @zh
comment: Y <является источником> X. Например, " миндаль (орехи)" <является источником> "миндальное масло", "апельсины" <является источником> "апельсиновый сок". Используется, чтобы показать связь между организмом и производным продуктом: "овцы" <является источником> "баранина". @ru
comment: Y <is source of> X. E.g. “almonds" <is source of> “almond oil”, “sweet oranges”<is source of> “orange juice". Use to relate an organism with a derived product: “sheep” <is source of> “mutton”. @en
comment: Y <est source de> X. Ex. "amande" <est source de> "huile d'amande", "oranges douce" <est source de> "jus d'orange". Utiliser pour relier un organisme à un produit dérivé : "ovin" <est source de> "viande ovine". @fr
comment: Y <es fuente de> X. E.g. “Almendra" <es fuente de> “Aceite de almendra", “Naranja dulce” <es fuente de> “Zumo de naranja". Se utiliza para relacionar un organismo con un producto derivado: “Ovino” <es fuente de> “Carne de carnero”.
label: 是...的来源 @zh
label: هو مصدر @ar
label: является источником @ru
label: Is source of @en
label: Est source de @fr

Es componente de
sub property of: isPartOf
comment: س <هي مكون من> ع. الكائن س هو جزء من ع بالكامل وله أيضاً وجود مستقل عن ع. على سبيل المثال: "الورقة" <هي مكون من > "الشجرة" " المحركات" <هي مكون من > "منظومات المركبات". @ar
comment: X <является компонентом> Y. Объект X, который является частью целого Y, также имеет существование независимо от Y. Например, "листья" <является компонентом> "деревья", "двигатели" <является компонентом> "системы машин". @ru
comment: X <est un composant de> Y. Un objet X qui fait partie d'un Y entier, a également une existence indépendante de Y. Par exemple, "feuille" <est un composant de> "arbre", "moteur" <est un composant de> "organe de véhicule" . @fr
comment: X <es componente de> Y. Un objeto X que forma parte de un conjunto Y, también tiene una existencia independiente de Y. Ej. "Hoja" <es componente de> "Árbol", "Motore" <es componente de> "Componente del vehículo".
comment: X<是...的组成部分>Y。物体X是整体Y的一部分，同时也独立于Y存在。例如：“叶”<是...的组成部分>“树”，“发动机”<是...的组成部分>“车辆系统”。 @zh
comment: X <is component of> Y. An object X that is a part of a whole Y, also has an existence independently from Y. E.g. "leaves" <is component of> "trees", "engines" <is component of> "vehicle systems". @en
label: 是...的组成部分 @zh
label: هو مكون من @ar
label: является компонентом @ru
label: Is component of @en
label: Est un composant de @fr

Tiene componente
sub property of: hasPart
comment: س <يحتوي على> ع. الكائن س هو جزء من ع بالكامل وله أيضاً وجود مستقل عن ع. على سبيل المثال: "الأشجار" <تحتوي على > "الأوراق" " منظومات المركبات" <تحتوي على > "المحركات". @ar
comment: Y<有组成部分>X。物体X是整体Y的一部分，同时也独立于Y存在。例如：“树”<有组成部分>“叶”，“车辆系统”<有组成部分>“发动机”。 @zh
comment: Y <имеет компонент> X. Объект X, который является частью целого Y и также имеет существование независимо от Y. Например, "деревья" <имеет компонент "листья", "системы машин" <имеет компонент> "двигатели". @ru
comment: Y <tiene componente> X. Un objeto X que es una parte de un todo Y y tiene también una existencia independiente de Y. Ex. Par exemple, "Árboles" <tiene componente> "Hojas", "Componentes del vehículo" <tiene componente> "Motores".
comment: Y <has component> X. An object X that is a part of a whole Y and also has an existence independently from Y. E.g. "trees" <has component> "leaves", "vehicle systems" <has component> "engines". @en
comment: Y <a le composant> X. Un objet X qui fait partie d'un Y entier et a également une existence indépendamment de Y. Par exemple, "arbre" <a le composant> "feuille", "organe de véhicule" <a le composant> "moteur". @fr
label: 有组成部分 @zh
label: مكون @ar
label: имеет компонент @ru
label: Has component @en
label: A le composant @fr

Se utiliza como
sub property of: processRelationship
comment: X <用作> Y. 例如 : "山梨醇" <用作> "甜味剂"; "乙醇" <用作> "燃料". @zh
comment: X <se utiliza como> Y. Ej. "Sorbitol" <se utiliza como> "Edulcorante"; "Etánol" <se utiliza como> "Combustible".
comment: X <is used as> Y. E.g. "sorbitol" <is used as> "sweetener"; "ethanol" <is used as> "fuel". @en
comment: X <est utilisé comme> Y. Par exemple: "sorbitol" <est utilisé comme> "édulcorant"; "éthanol" <est utilisé comme> "combustible". @fr
comment: X <مستعمل ك> Y: "سربتول" <مستعمل ك> "محليات"; "إيثانول" <مستعمل ك> "وقود". @ar
comment: X <направлен на> Y. X направлен на цель или процесс Y. Например, "ветеринарные услуги" <направлен на> "здоровье животных", "рубки обновления" <направлен на> "естественное возобновление". @ru
label: 用作 @zh
label: مستعمل ك @ar
label: используется как @ru
label: Is used as @en
label: Est utilisé comme @fr

AGROVOC
type: ConceptScheme

شکر
type: Label
in dataset: Agrovoc
created: 2007-04-20T00:00:00Z
has related term: قند (فراورده تجاری)
notation: 81174

açúcar
type: Label
in dataset: Agrovoc
created: 2023-08-28T17:26:42Z
notation: 7498

цукор
type: Label
in dataset: Agrovoc
created: 2022-10-27T00:39:27
notation: 7498

sukari
type: Label
in dataset: Agrovoc
created: 2021-03-22T11:50:43
notation: 7498

sukker
type: Label
in dataset: Agrovoc
created: 2019-05-17T11:55:58.294+02:00
notation: 7498

sukker
type: Label
in dataset: Agrovoc
created: 2019-05-17T11:55:48.69+02:00
notation: 7498

ζάχαρη
type: Label
in dataset: Agrovoc
created: 2019-05-17T11:55:29.652+02:00
notation: 7498

sokeri
type: Label
in dataset: Agrovoc
created: 2019-05-17T11:55:14.218+02:00
notation: 7498

socker
type: Label
in dataset: Agrovoc
created: 2019-05-17T11:55:00.997+02:00
notation: 7498

zahăr
type: Label
in dataset: Agrovoc
created: 2015-08-15T11:59:43Z
modified: 2015-08-18T21:48:44Z
notation: 7498

შაქარი
type: Label
in dataset: Agrovoc
created: 2017-08-09T11:37:07Z
modified: 2017-08-11T16:09:10Z
notation: 7498

şeker
type: Label
in dataset: Agrovoc
created: 2011-11-20T20:25:08Z
modified: 2014-07-03T19:03:54Z
notation: 7498

糖
type: Label
in dataset: Agrovoc
created: 2002-12-12T00:00:00Z
notation: 7498

น้ำตาล
type: Label
in dataset: Agrovoc
created: 2005-08-19T00:00:00Z
notation: 7498

cukor
type: Label
in dataset: Agrovoc
created: 2005-12-16T00:00:00Z
notation: 7498

сахар
type: Label
in dataset: Agrovoc
created: 2009-03-25T00:00:00Z
notation: 7498

açúcar
type: Label
in dataset: Agrovoc
created: 1998-08-04T00:00:00Z
modified: 2021-06-16T21:24:42Z
notation: 7498

Cukier spożywczy
type: Label
in dataset: Agrovoc
created: 2006-12-19T00:00:00Z
notation: 7498

ນ້ຳຕານ
type: Label
in dataset: Agrovoc
created: 2005-12-16T00:00:00Z
notation: 7498

설탕
type: Label
in dataset: Agrovoc
created: 2009-12-02T00:00:00Z
notation: 7498

砂糖
type: Label
in dataset: Agrovoc
created: 2005-08-09T00:00:00Z
notation: 7498

Zucchero
type: Label
in dataset: Agrovoc
created: 2006-12-30T00:00:00Z
notation: 7498

cukor
type: Label
in dataset: Agrovoc
created: 2006-12-06T00:00:00Z
notation: 7498

शर्करा
type: Label
in dataset: Agrovoc
created: 1981-01-09T00:00:00Z
notation: 7498

sucre
type: Label
in dataset: Agrovoc
created: 1981-01-21T00:00:00Z
modified: 2021-05-24T17:34:42Z
notation: 7498

قند (فراورده تجاری)
type: Label
in dataset: Agrovoc
created: 2007-04-20T00:00:00Z
has related term: شکر
notation: 7498

Azúcar
type: Label
in dataset: Agrovoc
created: 1981-01-23T00:00:00Z
notation: 7498

sugar
type: Label
in dataset: Agrovoc
created: 1981-01-09T00:00:00Z
notation: 7498

Zucker
type: Label
in dataset: Agrovoc
created: 1996-12-24T00:00:00Z
notation: 7498

cukr
type: Label
in dataset: Agrovoc
created: 2003-03-27T00:00:00Z
notation: 7498

سكر
type: Label
in dataset: Agrovoc
created: 2002-12-12T00:00:00Z
notation: 7498

prefLabel
comment: A resource has no more than one value of skos:prefLabel per language tag. @en

Azúcar
type: Concept
narrower: Isoglucosa
narrower: Azúcar blanco
narrower: Azúcar refinado
narrower: Azúcar crudo
narrower: Azúcar de palma
narrower: Azúcar de caña
narrower: Panela
narrower: Azúcar de remolacha
narrower: Melaza
Producto de: Industria azucarera
Es objeto de la actividad: Tecnología del azúcar
Es objeto de la actividad: Adición de cristales semilla (azúcar)
Es producido por: Planta azucarera
Es utilizado en: Chaptalizacion
alternative label: شکر @fa
in dataset: Agrovoc
Es fuente de: Caramelo
Es componente de: Alimento
created: 2011-11-20T20:25:08Z
Tiene componente: Sucrosa
Se utiliza como: Edulcorante
related: Miel
in scheme: AGROVOC
scope note: Kommerzielles Produkt; für die chemischen Verbindungen <7507> benutzen @de
scope note: Ticari ürün; kimyasal bileşikler için <7507> kodlu terimi kullan @tr
scope note: น้ำตาลที่เป็นผลิตภัณฑ์การค้า, สำหรับสารประกอบเคมีใช้ <7507> @th
scope note: Açúcar comercial; para açúcares em química usar <7507> @pt
scope note: Produkt przemysłowy; do substancji chemicznych używaj <7507> @pl
scope note: ຜະລິດພັນທີ່ເປັນການຄ້າ; ສຳລັບສານເຄມີ ໃຊ້ <7507> @lo
scope note: Zucchero commerciale; per zuccheri quali composti chimici usare <7507> @it
scope note: Kereskedelmi termék; Kémiai vegyület: <7507> @hu
scope note: Produit de commerce; pour les composes chimiques utiliser <7507> @fr
scope note: محصول تجاری؛ برای ترکیبات شیمیایی به کار برید ""قندها (ترکیبات شیمیایی)"" @fa
scope note: Producto comercial; para compuestos químicos use <7507>
scope note: Commercial product; for chemical compounds use <7507> @en
alt label: شکر
pref label: açúcar
pref label: цукор
pref label: sukari
pref label: sukker
pref label: ζάχαρη
pref label: sokeri
pref label: socker
pref label: zahăr
pref label: შაქარი
pref label: şeker
pref label: 糖
pref label: น้ำตาล
pref label: cukor
pref label: сахар
pref label: Cukier spożywczy
preferred label: açúcar @pt-br
preferred label: цукор @uk
preferred label: sukari @sw
preferred label: sukker @nb
preferred label: ζάχαρη @el
preferred label: sokeri @fi
preferred label: socker @sv
preferred label: zahăr @ro
preferred label: შაქარი @ka
preferred label: şeker @tr
preferred label: 糖 @zh
preferred label: น้ำตาล @th
preferred label: cukor @sk
preferred label: сахар @ru
preferred label: Cukier spożywczy @pl
preferred label: سكر @ar
preferred label: cukr @cs
preferred label: Zucker @de
preferred label: sugar @en
preferred label: قند (فراورده تجاری) @fa
preferred label: sucre @fr
preferred label: शर्करा @hi
preferred label: Zucchero @it
preferred label: 砂糖 @ja
preferred label: 설탕 @ko
preferred label: ນ້ຳຕານ @lo
modified: 2024-09-24T16:01:29
broader: Producto vegetal procesado

Isoglucosa
type: Concept
preferred label: shira ya nafaka ya fructose ya juu @sw
preferred label: Glukose-Fruktose-Sirup @de
preferred label: high fructose corn syrup @nb
preferred label: 果葡糖浆 @zh
preferred label: високофруктозний кукурудзяний сироп @uk
preferred label: అధిక ఫాలోజు మొక్కజొన్న షర్బతు @te
preferred label: yüksek fruktozlu mısır şurubu @tr
preferred label: น้ำเชื่อมฟรุคโตสสูงจากข้าวโพด @th
preferred label: kukuričný fruktózový sirup @sk
preferred label: عصير الذرة المركز عالي الفركتوز @ar
preferred label: kukuřičný fruktózový sirup @cs
preferred label: شربت ذرت فروکتوزبالا @fa
preferred label: isoglucose @fr
preferred label: उच्च फ्रुक्टोस कार्न सीरप @hi
preferred label: magas fruktóztartalmú kukoricaszirup @hu
preferred label: Isoglucosio @it
preferred label: 異性化糖 @ja
preferred label: ນ້ຳເຊື່ອມຟຼຸກໂຕສສາລີເຂັ້ມຂຸ້ນ @lo
preferred label: Syrop glukozowo-fruktozowy @pl
preferred label: высокофруктозный кукурузный сироп @ru
broader: Azúcar

Azúcar blanco
type: Concept
preferred label: zahăr alb @ro
preferred label: білий цуккор @uk
preferred label: sukari nyeupe @sw
preferred label: السكر الأبيض @ar
preferred label: თეთრი შაქარი @ka
preferred label: Weißzucker @de
preferred label: beyaz şeker @tr
preferred label: 白糖 @zh
preferred label: น้ำตาลทรายขาว @th
preferred label: bílý cukr @cs
preferred label: white sugar @en
preferred label: قند سفيد @fa
preferred label: sucre blanc @fr
preferred label: सफेद शर्करा @hi
preferred label: fehér cukor @hu
preferred label: Zucchero bianco @it
preferred label: 백설탕 @ko
preferred label: ນ້ຳຕານຂາວ @lo
preferred label: Cukier biały @pl
preferred label: açúcar branco @pt
preferred label: сахар-песок @ru
broader: Azúcar

Azúcar refinado
type: Concept
preferred label: açúcar refinado @pt-br
preferred label: sukari iliyosafishwa @sw
preferred label: السكر المكرر @ar
preferred label: zahăr rafinat @ro
preferred label: რაფინირებული შაქარი @ka
preferred label: raffinierter Zucker @de
preferred label: rafine şeker @tr
preferred label: 精糖 @zh
preferred label: น้ำตาลทรายบริสุทธิ์ @th
preferred label: rafinovaný cukr @cs
preferred label: refined sugar @en
preferred label: شكر تصفيه‌شده @fa
preferred label: sucre raffiné @fr
preferred label: शुद्ध शर्करा @hi
preferred label: finomított cukor @hu
preferred label: Zucchero raffinato @it
preferred label: 精製糖、精糖 @ja
preferred label: 정제설탕 @ko
preferred label: ນ້ຳຕານບໍລິສຸດ @lo
preferred label: Cukier rafinowany @pl
preferred label: сахар-рафинад @ru
broader: Azúcar

Azúcar crudo
type: Concept
preferred label: zahăr brut @ro
preferred label: цукор-сирець @uk
preferred label: sukari isiyotengenezwa @sw
preferred label: السكر الخام @ar
preferred label: сахар-сырец @ru
preferred label: ham şeker @tr
preferred label: 原糖 @zh
preferred label: น้ำตาลทรายดิบ @th
preferred label: surový cukr @cs
preferred label: Rohzucker @de
preferred label: raw sugar @en
preferred label: شكر خام @fa
preferred label: sucre roux @fr
preferred label: कच्ची शर्करा @hi
preferred label: nyers cukor @hu
preferred label: Zucchero grezzo @it
preferred label: 原料糖、粗糖 @ja
preferred label: 원당 @ko
preferred label: ນ້ຳຕານດີບ @lo
preferred label: Cukier surowy @pl
preferred label: açúcar não refinado @pt
broader: Azúcar

Azúcar de palma
type: Concept
preferred label: sukari ya mawese @sw
preferred label: سكر النخيل @ar
preferred label: zahăr din palmier @ro
preferred label: პალმის შაქარი @ka
preferred label: palmiye şekeri @tr
preferred label: 棕榈糖 @zh
preferred label: น้ำตาลปาล์ม @th
preferred label: palmový cukor @sk
preferred label: palmový cukr @cs
preferred label: Palmzucker @de
preferred label: palm sugar @en
preferred label: قند خرما @fa
preferred label: sucre de palme @fr
preferred label: ताड़ की शक्कर @hi
preferred label: pálmacukor @hu
preferred label: Zucchero di palma @it
preferred label: ヤシ糖 @ja
preferred label: 종려당 @ko
preferred label: ນ້ຳຕານປາມ @lo
preferred label: Cukier palmowy @pl
preferred label: açúcar de palma @pt
preferred label: пальмовый сахар @ru
broader: Azúcar

Azúcar de caña
type: Concept
preferred label: açúcar de cana @pt-br
preferred label: sukali @sw
preferred label: zahăr din trestie de zahăr @ro
preferred label: ლერწმის შაქარი @ka
preferred label: şeker kamışı şekeri @tr
preferred label: 蔗糖 @zh
preferred label: น้ำตาลอ้อย @th
preferred label: trstinový cukor @sk
preferred label: тростниковый сахар @ru
preferred label: سكر القصب @ar
preferred label: třtinový cukr @cs
preferred label: Rohrzucker @de
preferred label: cane sugar @en
preferred label: قند نیشکر @fa
preferred label: sucre de canne @fr
preferred label: गन्ना की चीनी @hi
preferred label: nádcukor @hu
preferred label: Zucchero di canna @it
preferred label: 甘蔗糖 @ja
preferred label: 수수설탕 @ko
preferred label: Cukier trzcinowy @pl
broader: Azúcar

Panela
type: Concept
preferred label: ягре @ru
preferred label: sukari guru @sw
preferred label: سكر بني @ar
preferred label: hurma şekeri @tr
preferred label: 椰子糖 @zh
preferred label: น้ำตาลทรายแดง @th
preferred label: 설탕 @ko
preferred label: jagárový cukr @cs
preferred label: Jagrezucker @de
preferred label: jaggery @en
preferred label: شكر زرد @fa
preferred label: jagre @fr
preferred label: गुड़ @hi
preferred label: Zucchero di canna integrale @it
preferred label: ジャッガリー @ja
preferred label: Cukier jaggery @pl
preferred label: açúcar candy @pt
preferred label: jagarový cukor @sk
broader: Azúcar

Azúcar de remolacha
type: Concept
preferred label: açúcar de beterraba @pt-br
preferred label: sukali ya beti @sw
preferred label: zahăr din sfeclă de zahăr @ro
preferred label: ჭარხლის შაქარი @ka
preferred label: pancar şekeri @tr
preferred label: 甜菜糖 @zh
preferred label: น้ำตาลจากหัวผักกาดหวาน @th
preferred label: repný cukor @sk
preferred label: свекловичный сахар @ru
preferred label: سكر البنجر @ar
preferred label: řepný cukr @cs
preferred label: Rübenzucker @de
preferred label: beet sugar @en
preferred label: قند چغندر @fa
preferred label: sucre de betterave @fr
preferred label: बीट शक्कर @hi
preferred label: répacukor @hu
preferred label: Zucchero di barbabietola @it
preferred label: 무우설탕 @ko
preferred label: Cukier buraczany @pl
broader: Azúcar

Melaza
type: Concept
preferred label: melaço @pt-br
preferred label: molasi @sw
preferred label: melasse @nb
preferred label: меласа @sr
preferred label: melasă @ro
preferred label: melassi @fi
preferred label: melass @sv
preferred label: მელასა @ka
preferred label: melas @tr
preferred label: Molases @ms
preferred label: 糖蜜 @zh
preferred label: กากน้ำตาล @th
preferred label: melasa @sk
preferred label: меласса @ru
preferred label: دبس @ar
preferred label: Melasse @de
preferred label: molasses @en
preferred label: ملاس @fa
preferred label: mélasse @fr
preferred label: शीरा @hi
preferred label: melasz @hu
preferred label: Melasso @it
preferred label: 당밀 @ko
preferred label: ຂີ້ນ້ຳຕານ @lo
preferred label: Melasa @pl
broader: Azúcar

Industria azucarera
type: Concept
preferred label: indústria açucareira @pt-br
preferred label: utendaji ya sukari @sw
preferred label: შაქრის მრეწველობა @ka
preferred label: industria zahărului @ro
preferred label: şeker sanayisi @tr
preferred label: 制糖业 @zh
preferred label: อุตสาหกรรมน้ำตาล @th
preferred label: cukrovarnícky priemysel @sk
preferred label: сахарная промышленность @ru
preferred label: صناعة السكر @ar
preferred label: cukrovarnický průmysl @cs
preferred label: Zuckerindustrie @de
preferred label: sugar industry @en
preferred label: صنعت قند @fa
preferred label: industrie du sucre @fr
preferred label: शर्करा उद्योग @hi
preferred label: cukoripar @hu
preferred label: Industria saccarifera @it
preferred label: 製糖工業 @ja
preferred label: 제당산업 @ko
preferred label: ອຸດສາຫະກຳນ້ຳຕານ @lo
preferred label: Przemysł cukrowniczy @pl
has product: Azúcar

Tecnología del azúcar
type: Concept
preferred label: შაქრის ტექნოლოგია @ka
preferred label: tecnologia do açúcar @pt-br
preferred label: teknolojia ya sukari @sw
preferred label: технології виробництва цукру @uk
preferred label: şeker teknolojisi @tr
preferred label: 糖工艺 @zh
preferred label: เทคโนโลยีน้ำตาล @th
preferred label: technológia výroby cukru @sk
preferred label: технология сахарного производства @ru
preferred label: تكنولوجيا السكر @ar
preferred label: technologie výroby cukru @cs
preferred label: Zuckertechnologie @de
preferred label: sugar technology @en
preferred label: فناوری قند @fa
preferred label: technologie sucrière @fr
preferred label: शर्करा प्रौद्योगिकी @hi
preferred label: cukortechnológia @hu
preferred label: Tecnologia dello zucchero @it
preferred label: 製糖技術 @ja
preferred label: ເທັກໂນໂລຢີນ້ຳຕານ @lo
preferred label: Technologia produkcji cukru @pl
has object of activity: Azúcar

Adición de cristales semilla (azúcar)
type: Concept
preferred label: mbegu (sukari) @sw
preferred label: poding (sukker) @nb
preferred label: podning (sukker) @da
preferred label: ensemencement (sucre) @fr
preferred label: البذر (سكر) @ar
preferred label: Sieden (Zucker) @de
preferred label: seeding (sugar) @en
preferred label: वयन (शर्करा) @hi
preferred label: beoltás (cukor) @hu
preferred label: Cristallizzazione (zucchero) @it
preferred label: 種まき、核入れ @ja
preferred label: ນ້ຳຕານເມັດ @lo
preferred label: Zaszczepianie (cukier) @pl
preferred label: затравка (сахар) @ru
preferred label: varenie cukru @sk
preferred label: เม็ด (น้ำตาล) @th
preferred label: 放晶种 @zh
preferred label: krystalizace (cukru) @cs
preferred label: tohumlama (şeker) @tr
has object of activity: Azúcar

Planta azucarera
type: Concept
preferred label: цукраносныя культуры @be
preferred label: mimea ya sukari @sw
preferred label: цукроносні культури @uk
preferred label: plante zaharoase @ro
preferred label: şeker bitkisi @tr
preferred label: 糖料作物 @zh
preferred label: พืชน้ำตาล @th
preferred label: cukrodarné rastliny @sk
preferred label: сахароносные культуры @ru
preferred label: محاصيل سكرية @ar
preferred label: cukrodárné plodiny @cs
preferred label: Zuckerpflanze @de
preferred label: sugar crops @en
preferred label: محصولات زراعی قندی @fa
preferred label: plante sucrière @fr
preferred label: शर्करा फसलें @hi
preferred label: cukornövény @hu
preferred label: Colture da zucchero @it
preferred label: 감미작물 @ko
preferred label: ພືດນ້ຳຕານ @lo
preferred label: Roślina cukrodajna @pl
preferred label: planta açucareira @pt
produces: Azúcar

Chaptalizacion
type: Concept
preferred label: chaptalization @sw
preferred label: chaptalização @pt-br
preferred label: محلّى العُصار @ar
preferred label: 加糖 @zh
preferred label: şaptalizasyon @tr
preferred label: chaptalování vína @cs
preferred label: Chaptalisierung @de
preferred label: chaptalisation @fr
preferred label: चैपटेलाइजेशन @hi
preferred label: chaptalozás @hu
preferred label: Captalizzazione @it
preferred label: 補糖 @ja
preferred label: 가당 @ko
preferred label: Szeptalizacja @pl
preferred label: шаптализация @ru
preferred label: cukrenie muštu @sk
make use of: Azúcar

Caramelo
type: Concept
preferred label: sukari iliyounguzwa @sw
preferred label: karamell @nb
preferred label: კარამელი @ka
preferred label: caramel @ro
preferred label: цукровий колер @uk
preferred label: karamel @tr
preferred label: 焦糖 @zh
preferred label: คาราเมล @th
preferred label: сахарный колер @ru
preferred label: açúcar caramelizado @pt
preferred label: كرميلا @ar
preferred label: Karamel @de
preferred label: کارامل @fa
preferred label: कैरामेल (कलर) @hi
preferred label: Caramello @it
preferred label: カラメル @ja
preferred label: 캐러멜 @ko
preferred label: ເຂົ້າໜົມກະຮາແມນ @lo
preferred label: Karmel @pl
is derived from: Azúcar

Alimento
type: Concept
preferred label: thực phẩm @vi
preferred label: alimento @pt-br
preferred label: vyakula @sw
preferred label: სურსათი @ka
preferred label: produse alimentare @ro
preferred label: храна @sr
preferred label: харчові продукти @uk
preferred label: ఆహారాలు @te
preferred label: gıda @tr
preferred label: Makanan @ms
preferred label: 食品 @zh
preferred label: อาหาร @th
preferred label: potraviny @sk
preferred label: продукты питания @ru
preferred label: أغذية @ar
preferred label: Lebensmittel @de
preferred label: foods @en
preferred label: غذاها @fa
preferred label: produit alimentaire @fr
preferred label: भोजन @hi
preferred label: élelmiszer @hu
preferred label: Alimenti @it
preferred label: 식품 @ko
preferred label: ທັນຍາຫານ @lo
preferred label: Żywność @pl
Tiene componente: Azúcar

Sucrosa
type: Concept
preferred label: sukari ya muwa na kiazi sukari @sw
preferred label: zaharoză @ro
preferred label: sukrose @nb
preferred label: საქაროზა @ka
preferred label: sukroz @tr
preferred label: 蔗糖(化学) @zh
preferred label: ซูโครส @th
preferred label: sacharóza @sk
preferred label: сахароза @ru
preferred label: sacarose @pt
preferred label: سكروز @ar
preferred label: Saccharose @de
preferred label: sucrose @en
preferred label: سوکروز @fa
preferred label: saccharose @fr
preferred label: सुक्रोज @hi
preferred label: szacharóz @hu
preferred label: Saccarosio @it
preferred label: 蔗糖 @ja
preferred label: 자당 @ko
preferred label: ຊຸກໂກຼສ @lo
preferred label: Sacharoza @pl
Es componente de: Azúcar

Edulcorante
type: Concept
preferred label: vitu vinavyoongeza utamu @sw
preferred label: søtningsmidler @nb
preferred label: підсолоджувачі @uk
preferred label: დამატკბობელი @ka
preferred label: îndulcitori @ro
preferred label: tatlandırıcı @tr
preferred label: 甜味剂 @zh
preferred label: สารให้ความหวาน @th
preferred label: sladidlá @sk
preferred label: подсластители @ru
preferred label: محليات @ar
preferred label: sladidla @cs
preferred label: Süßstoff @de
preferred label: sweeteners @en
preferred label: شیرین‌کننده‌ها @fa
preferred label: édulcorant @fr
preferred label: मीठा करने वाले @hi
preferred label: édesítõ @hu
preferred label: Dolcificanti @it
preferred label: 甘味料 @ja
preferred label: 감미료 @ko
preferred label: ທາດຫວານ @lo
preferred label: Środek słodzący @pl
preferred label: edulcorante @pt
is use of: Azúcar

Miel
type: Concept
preferred label: mel @pt-br
preferred label: asali @sw
preferred label: мед @sr
preferred label: honning @nn
preferred label: honung @sv
preferred label: miere @ro
preferred label: თაფლი @ka
preferred label: తేనె @te
preferred label: bal @tr
preferred label: Madu @ms
preferred label: 蜂蜜 @zh
preferred label: น้ำผึ้ง @th
preferred label: med @sk
preferred label: mel de abelha @pt
preferred label: عسل @ar
preferred label: Honig @de
preferred label: honey @en
preferred label: miel @fr
preferred label: मधु @hi
preferred label: méz @hu
preferred label: Miele @it
preferred label: 벌꿀 @ko
preferred label: ນ້ຳເຜີ້ງ @lo
preferred label: Miód @pl
related: Azúcar

Producto vegetal procesado
type: Concept
preferred label: bidhaa za mimea zilizosindikwa @sw
preferred label: рослинні продукти, піддані технологічній обробці @uk
preferred label: produse derivate de origine vegetală @ro
preferred label: Produk yang diproses berasaskan tumbuhan @ms
preferred label: işlenmiş bitkisel ürün @tr
preferred label: 植物性制品 @zh
preferred label: ผลิตภัณฑ์แปรรูปจากพืช @th
preferred label: spracované rastlinné produkty @sk
preferred label: منتجات نباتية معالجة @ar
preferred label: zpracované rostlinné produkty @cs
preferred label: verarbeitetes pflanzliches Produkt @de
preferred label: processed plant products @en
preferred label: فراورده‌های فراوری‌شده گیاهی @fa
preferred label: produit végétal transformé @fr
preferred label: संसाधित पौध-उत्पाद @hi
preferred label: feldolgozott növényi termék @hu
preferred label: Prodotti vegetali trasformati @it
preferred label: 加工植物製品 @ja
preferred label: ຜະລິດຕະພັນພືດສຳເລັດຮູບ @lo
preferred label: Produkt roślinny przetworzony @pl
preferred label: produto vegetal transformado @pt
preferred label: продукты переработки растительного происхождения @ru
narrower: Azúcar