Está afectado por
sub property of: causativeRelationship
comment: ع <يتأثر بـ >س . يغير الكائن "ع" حالته أو موقعه بسبب إجراء قام به العامل "س". على سبيل المثال. "الأشجار" تتأثر بـ "مبيدات الشجر" ، "جودة النقل" تتأثر "بالضرر الميكانيكي". لا تستخدم للأمراض أو الاضطرابات. لهؤلاء استخدم <afflicts / isAfflictedBy>. @ar
comment: на Y влияет X. Объект Y изменяет состояние или местоположение из-за действия агента X. Например, на "деревья" влияет "арборициды", на "качество транспортировки" влияет "механические повреждения". Не используйте для болезней или расстройств; для них используйте <поражает/на ... негативно влияет болезнь .....>. @ru
comment: Y<受...影响> X。对象Y的状态或位置由于媒介X的行为而发生变化。例如：“树”<受...影响>“树木毒杀剂”，“运输性能”<受...影响>“机械损伤”。 请勿用于疾病或病症；对于疾病和病症，使用<损伤/受...损伤>。 @zh
comment: Y <is affected by> X. An object Y changes state or location because of an action of an agent X. E.g. "trees" <is affected by> "arboricides", "transporting quality" <is affected by> "mechanical damage". Do not use for diseases or disorders; for those, use <afflicts/is afflicted by>. @en
comment: Y <está afectado por> X. Un objeto Y cambia de estado o ubicación debido a la acción de un agente X. Ej. "Árbol" <está afectado por> "Arboricida", "Aptitud para el transporte" <está afectado por> "Daño mecánico". No lo utilice para enfermedades o trastornos; para ellos, utilice <aflige/está afligido por>.
comment: Y <est affecté par> X. Un objet Y change d'état ou de localisation suite à l'action d'un agent X. Par exemple, "arbre" <est affecté par> "arboricide", "aptitude au transport" <est affecté par> "dégât mécanique". Ne l'utilisez pas pour des maladies ou des désordres: pour ceux-là, utilisez <afflige/est affligé par>. @fr
label: 受...影响 @zh
label: يتأثر بها @ar
label: на ... влияет .... @ru
label: Is affected by @en
label: Est affecté par @fr

Es objeto de la actividad
sub property of: processRelationship
comment: ع <هو هدف النشاط> س . ع هو محور النشاط س. على سبيل المثال "الصوف" <هو محور> "الجز" ، "المعاهدات" <هي محور > "التصديق". @ar
comment: Y <является объектом деятельности> X. Y является центром деятельности X. Например, "шерсть" <является объектом деятельности> "стрижка", "пакты" <является объектом деятельности> "ратификация". @ru
comment: Y <is object of activity> X. Y is the focus of activity X. E.g. “wool” <is object of activity> "shearing”, “treaties" <is object of activity> “ratification”. @en
comment: Y <est l'objet de l'activité> X. Y est le centre de l'activité X. Par exemple, “laine" <est l'objet de l'activité> "tonte", “traité” <est l'objet de l'activité> “ratification”. @fr
comment: Y <es objeto de la actividad> X. La actividad Y tiene como foco el concepto X. Ej. “Lana” <es objeto de la actividad> "Esquileo”, “Tratado" <es objeto de la actividad> “Ratificación”.
comment: X<是活动...的对象>Y。概念X是活动Y关注的对象。例如：“羊毛”<是活动...的对象>“剪毛”，“条约”<是活动...的对象>“批准”。 @zh
label: 是活动...的对象 @zh
label: هو محور النشاط @ar
label: является объектом деятельности @ru
label: Is object of activity @en
label: Est l'objet de l'activité @fr

Compone
sub property of: isPartOf
comment: ع <يؤلف> س. ع هي الأداة أو المادة التي تتكون منها س. على سبيل المثال: "النباتات الجرثومية" <تؤلف > "نباتات التربة" "مواد بركانية" <تؤلف> " صخر tuff" @ar
comment: Y<组成>X。Y是组成X的材料或物质。例如：“微生物菌群”<组成>“土壤植物区系”，“火山灰物质”<组成>“凝灰岩”。 @zh
comment: Y <compose> X. Y is the material or substance of which X is composed. E.g. “microbial flora” <compose> "soil flora", “volcanic materials” <compose> "tuff". @en
comment: Y <compose> X. Y est le matériau ou la substance dont X est composé. Par exemple, "flore microbienne" <compose> "flore du sol", "matériau volcanique" <compose> "tuff". @fr
comment: Y <compone> X. Y es el material o sustancia de la que se compone X. Ej. Par exemple, "Flora microbiana" <compone> "Flora del suelo", "Material volcánico" <compone> "Toba".
comment: Y - <то, из чего состоит> X. Y - это материал или вещество, из которого состоит X. Например, "микробная флора" - <то, из чего состоит> "почвенная флора", "вулканогенные материалы" - <то, из чего состоит> "туф (вулканический). @ru
label: تتكون Y من @ar
label: то, из чего состоит @ru
label: Compose @fr
label: 组成 @zh

Tiene parte
sub property of: partitiveRelationship
comment: س <له جزء> ع. الكيان المركب س يمكن تحديده على أنه مكون من جزء واحد أو أكثر ، بينها ع. على سبيل المثال: "الساق" <لها جزء>" القشرة" "الجذور" <لها جزء> "عقد الجذور". استخدم هذه العلاقة عندما لا تنطبق أي من العلاقات الجزئية السفلية الأخرى (<لها مكون> ، <مكون من> ، <عضو>). @ar
comment: X<有部分>Y。复合实体X可被认定为由一个或多个部分组成，其中包括Y。例如：“茎”<有部分>“皮层”，“根”<有部分>“根节结”。用于其他下位整体部分关系（<有组成部分>，<是...的组成部分>，<是...的成员>）都不适用时。 @zh
comment: X <имеет часть> Y. Составная сущность X, которая может быть идентифицирована как состоящая из одной или более частей, между которыми Y. Например, "стебли" <имеет часть> "кортекс", "корни" <имеет часть> "корневые клубеньки". Используйте это отношение, когда ни одно из других низших партитивных отношений (<имеет компонент>, <состоит из>, <является членом>) не применимо. @ru
comment: X <tiene parte> Y. Una entidad compuesta X que puede ser identificada como compuesta por una o más partes, entre las cuales Y. Por ejemplo, "Tallo" <tiene parte> "Cortex", "Raíz" <tiene parte> "Nudosidad radicular". Utilice esta relación cuando ninguna de las otras relaciones partitivas inferiores (<tiene componente>, <está compuesto de>, <miembro>) sea aplicable.
comment: X <has part> Y. A composite entity X that can be identified as being composed of one or more parts, between which Y. E.g. “stems” <has part> “cortex”, “roots” <has part>“root nodules”. Use this relationship when none of the other lower partitive relations (<has component>, <is composed of>, <member>) apply. @en
comment: X <a partie> Y. Une entité composite X qui peut être identifiée comme composée d'une ou plusieurs parties, entre lesquelles Y. Par exemple, "tige" <a partie> "cortex", "racine" <a partie> "nodosité racinaire". Utilisez cette relation lorsqu'aucune des autres relations partitives inférieures (<a le composant>, <est composé de>, <membre de>) ne s'applique. @fr
label: 有部分 @zh
label: لديه جزء @ar
label: имеет часть @ru
label: Has part @en
label: A partie @fr

Incluido en
sub property of: partitiveRelationship
comment: ع <متضمن في> س. س هو كيان يتضمن العنصر ع على سبيل المثال: "عملية إزالة القرون" <متضمنة في>"طرق رعاية الحيوان" " تخصيص الموارد" <متضمنة في> "تحليل المياه" @ar
comment: Y<包含于>X。实体X包含元素Y。例如：“断角术”<包含于>“家畜饲养方法”，“微生物分析”<包含于>“水分析”。 @zh
comment: Y <включен в> X. X - это сущность, которая включена в элемент Y. Например, "удаление рогов" <включен в> "методы выращивания и содержания животных", "микробиологический анализ" <включен в> "анализ воды". @ru
comment: Y <is included in>X. X is an entity that includes the element Y. For example: "dehorning” <included in> ”animal husbandry methods”, “microbiological analysis" <included in> “water analysis” @en
comment: Y <incluido en>X. X es una entidad que incluye el elemento Y. Ej. "Descorne" <incluido en> "Método de crianza", "Análisis microbiológico" <incluido en> "Análisis de agua".
comment: X <est inclus dans> Y. X est une entité qui inclut l'élément Y. Par exemple, "écornage" <est inclus dans> "méthode d'élevage", "analyse microbiologique" <est inclus dans> "analyse de l'eau". @fr
label: 包含于 @zh
label: مدرج في @ar
label: включен в @ru
label: Is included in @en
label: Est inclus dans @fr

Es fuente de
sub property of: causativeRelationship
comment: ع <هو مصدر> س. على سبيل المثال: " اللوز" <هو مصدر> "زيت اللوز" "البرتقال الحلو" <هو مصدر> " عصير البرتقال" تستخدم لربط كائن حي بمنتج مشتق: "الخروف" <هو مصدر> "لحم الضأن" @ar
comment: Y<是...的来源>X。例如：“杏仁”<是...的来源>“杏仁油”，“甜橙”<是...的来源>“橙汁”。用于表示生物体及其衍生产品的关系：“绵羊”<是...的来源>“羊肉”。 @zh
comment: Y <является источником> X. Например, " миндаль (орехи)" <является источником> "миндальное масло", "апельсины" <является источником> "апельсиновый сок". Используется, чтобы показать связь между организмом и производным продуктом: "овцы" <является источником> "баранина". @ru
comment: Y <is source of> X. E.g. “almonds" <is source of> “almond oil”, “sweet oranges”<is source of> “orange juice". Use to relate an organism with a derived product: “sheep” <is source of> “mutton”. @en
comment: Y <est source de> X. Ex. "amande" <est source de> "huile d'amande", "oranges douce" <est source de> "jus d'orange". Utiliser pour relier un organisme à un produit dérivé : "ovin" <est source de> "viande ovine". @fr
comment: Y <es fuente de> X. E.g. “Almendra" <es fuente de> “Aceite de almendra", “Naranja dulce” <es fuente de> “Zumo de naranja". Se utiliza para relacionar un organismo con un producto derivado: “Ovino” <es fuente de> “Carne de carnero”.
label: 是...的来源 @zh
label: هو مصدر @ar
label: является источником @ru
label: Is source of @en
label: Est source de @fr

Es componente de
sub property of: isPartOf
comment: س <هي مكون من> ع. الكائن س هو جزء من ع بالكامل وله أيضاً وجود مستقل عن ع. على سبيل المثال: "الورقة" <هي مكون من > "الشجرة" " المحركات" <هي مكون من > "منظومات المركبات". @ar
comment: X <является компонентом> Y. Объект X, который является частью целого Y, также имеет существование независимо от Y. Например, "листья" <является компонентом> "деревья", "двигатели" <является компонентом> "системы машин". @ru
comment: X <est un composant de> Y. Un objet X qui fait partie d'un Y entier, a également une existence indépendante de Y. Par exemple, "feuille" <est un composant de> "arbre", "moteur" <est un composant de> "organe de véhicule" . @fr
comment: X <es componente de> Y. Un objeto X que forma parte de un conjunto Y, también tiene una existencia independiente de Y. Ej. "Hoja" <es componente de> "Árbol", "Motore" <es componente de> "Componente del vehículo".
comment: X<是...的组成部分>Y。物体X是整体Y的一部分，同时也独立于Y存在。例如：“叶”<是...的组成部分>“树”，“发动机”<是...的组成部分>“车辆系统”。 @zh
comment: X <is component of> Y. An object X that is a part of a whole Y, also has an existence independently from Y. E.g. "leaves" <is component of> "trees", "engines" <is component of> "vehicle systems". @en
label: 是...的组成部分 @zh
label: هو مكون من @ar
label: является компонентом @ru
label: Is component of @en
label: Est un composant de @fr

Afecta
sub property of: causativeRelationship
comment: س <يؤثر على> ع. أي إجراء من العامل س يؤدي إلى تغيير حالة أو موقع ع على سبيل المثال: "نضوب المياه" <يؤثر على> "منسوب المياه الجوفية" "الضرر الميكانيكي" <يؤثر على> "جودة النقل" لا تستخدم للأمراض أو الاضطرابات. لهؤلاء استخدم <afflicts / isAfflictedBy>. @ar
comment: X<影响> Y。媒介X的行为改变Y的状态或位置。例如：“水枯竭”<影响> “地下水位”，“机械损伤”<影响> “运输性能”。请勿用于疾病或病症；对于疾病和病症，使用<损害/受...损害>。 @zh
comment: X <влияет на> Y. Действие агента X изменяет состояние или местоположение Y. Например, "истощение водных ресурсов" <влияет на> "уровень грунтовых вод", "механические повреждения" <влияют на> "пригодность к транспортировке". Не используйте для болезней или расстройств; для них используйте <поражает/на ... негативно влияет болезнь .....>. @ru
comment: X <affects> Y. Action of agent X changes the state or location of Y. E.g. "water depletion" <affects> "groundwater table", "mechanical damage" <affects> “transporting quality”. Do not use for diseases or disorders; for those, use <afflicts/is afflicted by>. @en
comment: X <affecte> Y. L'agent X agit sur l'objet Y de telle sorte que Y change d'état ou de localisation. Par exemple, "tarissement" <affecte> "nappe souterraine", "dégât mécanique" <affecte> "aptitude au transport". Ne l'utilisez pas pour des maladies ou des désordres : pour ceux-là, utilisez <afflige/est affligé par>. @fr
comment: X <afecta> Y. La acción del agente X cambia el estado o la ubicación de Y. Ej. "Agotamiento del agua" <afecta> "Capa freática", "Daño mecánico" <afecta> "Aptitud para el transporte". No lo utilice para enfermedades o trastornos; para ellos, utilice <aflige/está afligido por>.
label: يؤثر @ar
label: влияет на @ru
label: Affects @en
label: Affecte @fr
label: 影响 @zh

Tiene componente
sub property of: Tiene parte
comment: س <يحتوي على> ع. الكائن س هو جزء من ع بالكامل وله أيضاً وجود مستقل عن ع. على سبيل المثال: "الأشجار" <تحتوي على > "الأوراق" " منظومات المركبات" <تحتوي على > "المحركات". @ar
comment: Y<有组成部分>X。物体X是整体Y的一部分，同时也独立于Y存在。例如：“树”<有组成部分>“叶”，“车辆系统”<有组成部分>“发动机”。 @zh
comment: Y <имеет компонент> X. Объект X, который является частью целого Y и также имеет существование независимо от Y. Например, "деревья" <имеет компонент "листья", "системы машин" <имеет компонент> "двигатели". @ru
comment: Y <tiene componente> X. Un objeto X que es una parte de un todo Y y tiene también una existencia independiente de Y. Ex. Par exemple, "Árboles" <tiene componente> "Hojas", "Componentes del vehículo" <tiene componente> "Motores".
comment: Y <has component> X. An object X that is a part of a whole Y and also has an existence independently from Y. E.g. "trees" <has component> "leaves", "vehicle systems" <has component> "engines". @en
comment: Y <a le composant> X. Un objet X qui fait partie d'un Y entier et a également une existence indépendamment de Y. Par exemple, "arbre" <a le composant> "feuille", "organe de véhicule" <a le composant> "moteur". @fr
label: 有组成部分 @zh
label: مكون @ar
label: имеет компонент @ru
label: Has component @en
label: A le composant @fr

Está compuesto de
sub property of: Tiene parte
comment: س <يتكون من> ع. يتكون س من المادة أو الأداة ع. على سبيل المثال: "نباتات التربة" <تتكون من > "نباتات جرثومية" " صخر tuff"<يتكون من> "مواد بركانية". @ar
comment: X<由...组成>Y。X由材料或物质Y组成。例如：“土壤植物区系”<由...组成>“微生物菌群”，“凝灰岩”<由...组成>“火山灰物质”。 @zh
comment: X <состоит из> Y. X состоит из материала или вещества Y. Например, "почвенная флора" <состоит из> "микробная флора", "туф (вулканический)" <состоит из> "вулканогенные материалы". @ru
comment: X <is composed of> Y. X is composed of material or substance Y . E.g. “soil flora” <is composed of> “microbial flora”, “tuff”<is composed of> “volcanic materials”. @en
comment: X <está compuesto de> Y. X está compuesto de materia o sustancia Y. Ej. "Flora del suelo" <está compuesto de> "Flora microbiana", "Toba" <está compuesto de> "Material volcánico".
comment: X <est composé de> Y. X est composé de la matière ou de la substance Y. Par exemple, "flore du sol" <est composé de"flore microbienne", "tuff" <est composé de> "matériau volcanique". @fr
label: 由...组成 @zh
label: يتكون من @ar
label: состоит из @ru
label: Is composed of @en
label: Est composé de @fr

Tiene propriedad
sub property of: causativeRelationship
comment: س <لديه خاصية> ع. الخاصية قد تكون جودة أو ميزة. على سبيل المثال: البذرة"<لديها خاصية> "حجم البذرة" "النباتات الطبية" <لديها خاصية> "الخصائص الطبية" @ar
comment: X<有属性>Y。属性可以是一种性质或特点。例如：“种子”<有属性>“种子大小”和“种子活力”，“药用植物类” <有属性>“药物属性”。 @zh
comment: X <обладает свойством> Y. Свойство может быть качеством или признаком. Например, "семенной материал" <обладает свойством> "крупность семян", "лекарственные растения" <обладает свойством> "фармакологические свойства". @ru
comment: X <tiene propriedad> Y. Una propiedad puede ser una cualidad o un rasgo. Ej. “Semilla” <tiene propriedad> “Tamaño de la semilla", “Planta medicinal” <tiene propriedad> “Propiedad medicinal”.
comment: X <has property> Y. A property might be a quality or trait. E.g. “seed” <has property> “seed size", “medicinal plants” <has property> “medicinal properties”. @en
comment: X <a la propriété> Y. Une propriété peut être une qualité ou un trait. Par exemple, "semence" <a la propriété> "grosseur des semences", "plante médicinale" <a la propriété> "propriété pharmacologique". @fr
label: 有属性 @zh
label: لديه ممتلكات @ar
label: обладает свойством @ru
label: Has property @en
label: A la propriété @fr

AGROVOC
type: ConceptScheme

Hojas
type: Label
in dataset: Agrovoc
is replaced by: Hoja
created: 1981-01-23T00:00:00Z
modified: 2024-07-03T16:11:42Z
notation: 4243

Szpilka (liść)
type: Label
in dataset: Agrovoc
created: 2006-12-19T00:00:00Z
notation: 8975

برگ‌هاي ‌سوزني مخروطیان
type: Label
in dataset: Agrovoc
created: 2007-04-20T00:00:00Z
notation: 8975

Hoja
type: Label
in dataset: Agrovoc
created: 2024-07-03T16:11:42Z
notation: 4243

лісце
type: Label
in dataset: Agrovoc
created: 2024-02-09T15:19:26
notation: 4243

лишће
type: Label
in dataset: Agrovoc
created: 2023-11-06T09:20:27
notation: 4243

majani
type: Label
in dataset: Agrovoc
created: 2022-10-27T14:22:42Z
notation: 4243

blader
type: Label
in dataset: Agrovoc
created: 2022-01-07T12:24:45
notation: 4243

frunze
type: Label
in dataset: Agrovoc
created: 2020-08-29T19:07:50
notation: 4243

ფოთოლი
type: Label
in dataset: Agrovoc
created: 2019-12-31T08:34:12.626+01:00
notation: 4243

yaprak
type: Label
in dataset: Agrovoc
created: 2011-11-20T20:15:46Z
modified: 2017-11-23T13:20:48Z
notation: 4243

Daun
type: Label
in dataset: Agrovoc
created: 2011-07-13T18:19:23Z
modified: 2011-07-14T09:27:50Z
notation: 1310552363757

叶
type: Label
in dataset: Agrovoc
created: 2002-12-12T00:00:00Z
notation: 4243

ใบ
type: Label
in dataset: Agrovoc
created: 2005-08-19T00:00:00Z
modified: 2022-01-26T16:31:39
notation: 4243

listy
type: Label
in dataset: Agrovoc
created: 2005-12-16T00:00:00Z
modified: 2022-01-26T16:17:44
notation: 4243

листья
type: Label
in dataset: Agrovoc
created: 2008-01-06T00:00:00Z
modified: 2022-01-26T16:18:03
notation: 4243

folha
type: Label
in dataset: Agrovoc
created: 1998-08-04T00:00:00Z
modified: 2022-01-26T16:31:15
notation: 4243

Liść
type: Label
in dataset: Agrovoc
created: 2006-12-19T00:00:00Z
modified: 2022-01-26T16:31:05
notation: 4243

ໃບ
type: Label
in dataset: Agrovoc
created: 2005-12-16T00:00:00Z
modified: 2022-01-26T16:30:56
notation: 4243

잎
type: Label
in dataset: Agrovoc
created: 2009-12-02T00:00:00Z
modified: 2022-01-26T16:30:18
notation: 4243

葉
type: Label
in dataset: Agrovoc
created: 2005-08-09T00:00:00Z
modified: 2022-01-20T13:47:51
notation: 4243

Foglie
type: Label
in dataset: Agrovoc
created: 2006-10-23T00:00:00Z
modified: 2022-01-26T16:17:52
notation: 4243

levél
type: Label
in dataset: Agrovoc
created: 2006-12-06T00:00:00Z
modified: 2022-01-20T13:47:43
notation: 4243

पत्तियाँ
type: Label
in dataset: Agrovoc
created: 1981-01-09T00:00:00Z
modified: 2022-01-26T16:30:11
notation: 4243

feuille
type: Label
in dataset: Agrovoc
created: 1981-01-21T00:00:00Z
modified: 2022-01-26T16:30:05
notation: 4243

برگ‌ها
type: Label
in dataset: Agrovoc
created: 2007-04-20T00:00:00Z
modified: 2022-01-26T16:17:31
notation: 4243

leaves
type: Label
in dataset: Agrovoc
created: 1981-01-09T00:00:00Z
modified: 2022-01-26T16:17:05
notation: 4243

Blatt
type: Label
in dataset: Agrovoc
created: 1996-12-24T00:00:00Z
notation: 4243

listy
type: Label
in dataset: Agrovoc
created: 2003-03-27T00:00:00Z
modified: 2022-01-26T16:17:20
notation: 4243

أوراق
type: Label
in dataset: Agrovoc
created: 2002-12-12T00:00:00Z
notation: 4243

Plant organ borne by the stem, responsible for photosynthesis and gas exchange; comprised of the blade and petiole.
has source: Undersander, Dan. (2019). Forage Plant Structure, Function, Nutrition, and Growth. 10.1016/B978-0-12-812919-7.00001-9.
created: 2024-08-07T16:25:54

prefLabel
comment: A resource has no more than one value of skos:prefLabel per language tag. @en

Hoja
type: Concept
narrower: Acicula de conífera
narrower: Hoja bandera
narrower: Coleóptilo
narrower: Cotiledón
narrower: Vaina foliar
narrower: Zarcillo
narrower: Peciolo
narrower: Bráctea
Está afectado por: Filodia
Es objeto de la actividad: Análisis de tejido foliar
Compone: Follaje cortado
Tiene parte: Estoma
Incluido en: Filosfera
hidden label: Hojas
alternative label: Szpilka (liść) @pl
alternative label: برگ‌هاي ‌سوزني مخروطیان @fa
in dataset: Agrovoc
Es fuente de: Extracto de hoja
Es componente de: Follaje
Es componente de: Árbol
created: 2011-11-20T20:15:46Z
Afecta: Superficie foliar
Tiene componente: Nervadura foliar
Está compuesto de: Mesofilo
Tiene propriedad: Potencial hídrico foliar
in scheme: AGROVOC
alt label: Szpilka (liść)
alt label: برگ‌هاي ‌سوزني مخروطیان
pref label: Hoja
pref label: лісце
pref label: лишће
pref label: majani
pref label: blader
pref label: frunze
pref label: ფოთოლი
pref label: yaprak
pref label: Daun
pref label: 叶
pref label: ใบ
pref label: listy
pref label: листья
pref label: folha
pref label: Liść
pref label: ໃບ
pref label: 잎
pref label: 葉
pref label: Foglie
pref label: levél
pref label: पत्तियाँ
pref label: feuille
pref label: برگ‌ها
definition: Plant organ borne by the stem, responsible for photosynthesis and gas exchange; comprised of the blade and petiole.
preferred label: лісце @be
preferred label: лишће @sr
preferred label: majani @sw
preferred label: blader @nb
preferred label: frunze @ro
preferred label: ფოთოლი @ka
preferred label: yaprak @tr
preferred label: Daun @ms
preferred label: 叶 @zh
preferred label: ใบ @th
preferred label: listy @sk
preferred label: листья @ru
preferred label: folha @pt
preferred label: أوراق @ar
preferred label: Blatt @de
preferred label: leaves @en
preferred label: برگ‌ها @fa
preferred label: feuille @fr
preferred label: पत्तियाँ @hi
preferred label: levél @hu
preferred label: Foglie @it
preferred label: 葉 @ja
preferred label: 잎 @ko
preferred label: ໃບ @lo
preferred label: Liść @pl
modified: 2024-08-07T16:25:54
broader: Órgano vegetativo de la planta

Acicula de conífera
type: Concept
preferred label: إبرَ الصنوبريات @ar
preferred label: sindano za conifer @sw
preferred label: иглице четинара @sr
preferred label: ibre @tr
preferred label: barnåler @nb
preferred label: ace de conifere @ro
preferred label: წიწვი @ka
preferred label: 바늘엽 @ko
preferred label: शंकुफल नीडल @hi
preferred label: jehličí @cs
preferred label: ໃບແປກ @lo
preferred label: ihličie @sk
preferred label: 松针叶 @zh
preferred label: Aghi di conifere @it
preferred label: tûlevél @hu
preferred label: agulha de conífera @pt
preferred label: aiguille de conifère @fr
preferred label: conifer needles @en
preferred label: хвоя @ru
preferred label: 針葉 @ja
preferred label: Nadel (von Coniferen) @de
broader: Hoja

Hoja bandera
type: Concept
preferred label: flagblad @da
preferred label: flaggblad @sv
preferred label: praporcový list @cs
preferred label: flag leaf @en
preferred label: folha bandeira @pt
preferred label: الورقة الطرفية @ar
preferred label: vlagblad @nl
preferred label: feuille terminale @fr
preferred label: 旗叶 @zh
preferred label: флаговый лист @ru
preferred label: foglia bandiera @it
preferred label: bayrak yaprağı @tr
preferred label: лист заставичар @sr
preferred label: флагавы ліст @be
preferred label: Fahnenblatt @de
preferred label: jani la bendera @sw
broader: Hoja

Coleóptilo
type: Concept
preferred label: coleoptile @sw
preferred label: калеаптылі @be
preferred label: колеоптил @sr
preferred label: კოლეოპტილე @ka
preferred label: coleoptil @ro
preferred label: koleoptiler @nb
preferred label: kaleoptil @tr
preferred label: 胚芽鞘 @zh
preferred label: เยื่อหุ้มยอดแรกเกิด @th
preferred label: koleoptil @sk
preferred label: колеоптили @ru
preferred label: बीजपत्र @hi
preferred label: أغماد البرعم الأول @ar
preferred label: koleoptile @cs
preferred label: Koleoptile @de
preferred label: coleoptiles @en
preferred label: نیام‌های ساقه @fa
preferred label: coléoptile @fr
preferred label: Coleottili @it
preferred label: 子葉鞘 @ja
preferred label: 떡잎집 @ko
preferred label: ແພຈຸລັງຫຸ້ມຍອດເກີດໃໝ່ @lo
preferred label: Koleoptyl @pl
preferred label: coleoptilo @pt
broader: Hoja

Cotiledón
type: Concept
preferred label: kotiledoni @sw
preferred label: семядолі @be
preferred label: котиледони @sr
preferred label: çenek yaprak @tr
preferred label: cotiledon @ro
preferred label: ჩანასახის ლებანი @ka
preferred label: kotyledon @nb
preferred label: Kotiledon @ms
preferred label: 子叶 @zh
preferred label: ใบเลี้ยง @th
preferred label: kotyledony @sk
preferred label: семядоли @ru
preferred label: فلقات @ar
preferred label: dělohy @cs
preferred label: Kotyledone @de
preferred label: cotyledons @en
preferred label: لپه‌ها (اندام گیاه) @fa
preferred label: cotylédon @fr
preferred label: बीजपत्र @hi
preferred label: sziklevél @hu
preferred label: Cotiledoni @it
preferred label: 子葉 @ja
preferred label: 떡잎 @ko
preferred label: ໃບລ້ຽງ @lo
preferred label: Liścień @pl
preferred label: cotilédone @pt
broader: Hoja

Vaina foliar
type: Concept
preferred label: ala ya jani @sw
preferred label: похва ліставая @be
preferred label: омотач листа @sr
preferred label: غمد الورقة @ar
preferred label: ფოთლის ვაგინა @ka
preferred label: листовое влагалище @ru
preferred label: yaprak kını @tr
preferred label: 叶鞘 @zh
preferred label: listové pochvy @cs
preferred label: Blattscheide @de
preferred label: leaf sheaths @en
preferred label: نيام‌هاي برگ @fa
preferred label: gaine foliaire @fr
preferred label: पर्ण आवरण @hi
preferred label: levélhüvely @hu
preferred label: Guaine fogliari @it
preferred label: 葉鞘 @ja
preferred label: ກາບໃບ @lo
preferred label: Pochwa liściowa @pl
preferred label: baínha das folhas @pt
preferred label: กาบใบ @th
broader: Hoja

Zarcillo
type: Concept
preferred label: ukano @sw
preferred label: вусікі @be
preferred label: витице @sr
preferred label: ულვაში (მცენარისა) @ka
preferred label: నులితీగలు @te
preferred label: asma filizi @tr
preferred label: 卷须 @zh
preferred label: มือเกาะ @th
preferred label: úponky @sk
preferred label: усики растений @ru
preferred label: gavinha @pt
preferred label: محالق @ar
preferred label: Ranke @de
preferred label: tendrils @en
preferred label: پیچک‌ها @fa
preferred label: vrille @fr
preferred label: प्रतान @hi
preferred label: kacs @hu
preferred label: Viticci @it
preferred label: 巻きひげ @ja
preferred label: 덩굴손 @ko
preferred label: ມືເກາະ @lo
preferred label: Wąsy rośliny @pl
broader: Hoja

Peciolo
type: Concept
preferred label: petiole @sw
preferred label: петељке @sr
preferred label: ფოთლის ყუნწი @ka
preferred label: pețiol @ro
preferred label: petiyol @tr
preferred label: 叶柄 @zh
preferred label: ก้านใบ @th
preferred label: listové stopky @sk
preferred label: черешки @ru
preferred label: pecíolo @pt
preferred label: معاليق @ar
preferred label: řapíky @cs
preferred label: Blattstiel @de
preferred label: petioles @en
preferred label: دمبرگ‌ها @fa
preferred label: pétiole @fr
preferred label: पर्णवृन्त @hi
preferred label: levélnyél @hu
preferred label: Piccioli @it
preferred label: 葉柄 @ja
preferred label: 엽병 @ko
preferred label: ກ້ານໃບ @lo
preferred label: Ogonek liścia @pl
broader: Hoja

Bráctea
type: Concept
preferred label: bract @sw
preferred label: прыкветак @be
preferred label: приперак @sr
preferred label: თანაყვავილი @ka
preferred label: 苞片 @zh
preferred label: bractee @ro
preferred label: brakter @nb
preferred label: డిప్లై డియం @te
preferred label: bürgü @tr
preferred label: ใบประดับ @th
preferred label: listene @sk
preferred label: прицветники @ru
preferred label: bráctea @pt
preferred label: قنابات @ar
preferred label: listeny @cs
preferred label: Deckblatt @de
preferred label: bracts @en
preferred label: برگواره‌ها @fa
preferred label: bractée @fr
preferred label: सहपत्र @hi
preferred label: fellevél @hu
preferred label: Brattee @it
preferred label: 苞 @ja
preferred label: 포엽 @ko
preferred label: ໃບຊ້ອນດອກ @lo
preferred label: Liście przykwiatowe @pl
broader: Hoja

Filodia
type: Concept
preferred label: filódio @pt-br
preferred label: filodi @sw
preferred label: філодії @uk
preferred label: ფილოდია @ka
preferred label: 变叶病 @zh
preferred label: อาการแตกพุ่มฝอย @th
preferred label: fylódia @sk
preferred label: филлодии @ru
preferred label: تورق الزهر @ar
preferred label: fylodie @cs
preferred label: Phylloidie @de
preferred label: phyllody @en
preferred label: برگسانی @fa
preferred label: phyllodie @fr
preferred label: फाइलोडी / पर्णाभता @hi
preferred label: fillodia @hu
preferred label: Fillodia @it
preferred label: フィロディ @ja
preferred label: 엽화 @ko
preferred label: Liściak @pl
Afecta: Hoja

Análisis de tejido foliar
type: Concept
preferred label: uchambuzi wa tishu za majani @sw
preferred label: аналіз тканак лісця @be
preferred label: تحليل أنسجة الأوراق @ar
preferred label: análise de tecido foliar @pt-br
preferred label: analiză de ţesut foliar @ro
preferred label: аналіз тканин листа @uk
preferred label: Analisis tisu daun @ms
preferred label: పత్ర రోగ నిర్ధారణ @te
preferred label: yaprak doku analizi @tr
preferred label: 叶片组织分析 @zh
preferred label: analýza listové tkáně @cs
preferred label: Blattgewebeanalyse @de
preferred label: leaf tissue analysis @en
preferred label: تجزيه بافت برگ @fa
preferred label: analyse de tissu foliaire @fr
preferred label: पर्ण ऊतक विश्लेषण @hi
preferred label: levélszövet-elemzés @hu
preferred label: Analisi dei tessuti fogliari @it
preferred label: 葉組織分析 @ja
preferred label: Analiza tkanek liścia @pl
preferred label: анализ тканей листа @ru
preferred label: การวิเคราะห์เนื้อเยื่อใบ @th
has object of activity: Hoja

Follaje cortado
type: Concept
preferred label: folhagem de corte @pt-br
preferred label: kata majani @sw
preferred label: dekoratif yaprak @tr
preferred label: 切叶 @zh
preferred label: ไม้ตัดใบ @th
preferred label: zeleň na rez @sk
preferred label: декоративная зелень @ru
preferred label: أوراق حش @ar
preferred label: zeleň k řezu @cs
preferred label: Schnittgrün @de
preferred label: cut foliage @en
preferred label: سرشاخه‌های بریدنی @fa
preferred label: feuillage coupé @fr
preferred label: कट फोलिएज / कटे पत्ते @hi
preferred label: vágott zöld @hu
preferred label: Fogliame ornamentale da taglio @it
preferred label: 観賞用切葉 @ja
preferred label: ໃບໄມ້ຕັດ @lo
preferred label: Roślina cięta @pl
Está compuesto de: Hoja

Estoma
type: Concept
preferred label: вусцейка @be
preferred label: стоме @sr
preferred label: stomata @sw
preferred label: õhulõhed @et
preferred label: stomate @ro
preferred label: ბაგე @ka
preferred label: stoma @tr
preferred label: 气孔 @zh
preferred label: ปากใบ @th
preferred label: prieduchy @sk
preferred label: устьица @ru
preferred label: estoma @pt
preferred label: ثغير @ar
preferred label: průduchy @cs
preferred label: Stoma @de
preferred label: روزنه‌های هوایی @fa
preferred label: रंध्र @hi
preferred label: sztóma @hu
preferred label: Stomi @it
preferred label: 気孔 @ja
preferred label: 기공 @ko
preferred label: ປາກໃບ @lo
preferred label: Szparka oddechowa @pl
is part of: Hoja

Filosfera
type: Concept
preferred label: filosfera @pt
preferred label: phyllosphere @sw
preferred label: filosferă @ro
preferred label: ფილოსფერო @ka
preferred label: filosfer @tr
preferred label: 叶围 @zh
preferred label: ฟิลโลสเพียร์ @th
preferred label: филлосфера @ru
preferred label: الكرة الورقية @ar
preferred label: fylosféra @cs
preferred label: Phyllosphäre @de
preferred label: برگ‌سپهر @fa
preferred label: phyllosphère @fr
preferred label: फाइलोस्फीअरी @hi
preferred label: filloszféra @hu
preferred label: Fillosfera @it
preferred label: 葉圏 @ja
preferred label: 엽권 @ko
preferred label: ຟີລໂລສເພຍຣ @lo
includes: Hoja

Extracto de hoja
type: Concept
preferred label: kutolewa kwa majani @sw
preferred label: مستخلصات الأوراق @ar
preferred label: екстракти листа @sr
preferred label: extracte de frunze @ro
preferred label: పత్రసారాలు @te
preferred label: yaprak özütü @tr
preferred label: 树叶萃取物 @zh
preferred label: listové extrakty @cs
preferred label: Blattextrakt @de
preferred label: leaf extracts @en
preferred label: عصاره‌هاي برگ @fa
preferred label: extrait de feuille @fr
preferred label: पर्ण अर्क / निचोड़ @hi
preferred label: levélkivonat @hu
preferred label: Estratti fogliari @it
preferred label: 葉抽出物、葉抽出液 @ja
preferred label: Wyciąg z liści @pl
preferred label: extracto foliar @pt
preferred label: экстракты листьев @ru
preferred label: extrakty z listov @sk
preferred label: สารสกัดจากใบ @th
is derived from: Hoja

Follaje
type: Concept
preferred label: majani (ya mmea) @sw
preferred label: лістота @be
preferred label: ფოთლეული @ka
preferred label: పత్రాలు @te
preferred label: 叶子 @zh
preferred label: กลุ่มใบ @th
preferred label: листва @ru
preferred label: folhagem @pt
preferred label: ورق @ar
preferred label: yaprak @tr
preferred label: listoví @cs
preferred label: Laub @de
preferred label: foliage @en
preferred label: برگینه @fa
preferred label: feuillage @fr
preferred label: पर्णीय भाग @hi
preferred label: lomb @hu
preferred label: Fogliame @it
preferred label: 葉群、葉、群葉 @ja
preferred label: ໃບໄມ້ @lo
preferred label: Ulistnienie @pl
Tiene componente: Hoja

Árbol
type: Concept
preferred label: arbori @ro
preferred label: trær @nb
preferred label: träd @sv
preferred label: miti @sw
preferred label: ხე @ka
preferred label: చెట్లు @te
preferred label: ağaç @tr
preferred label: 树 @zh
preferred label: ไม้ยืนต้น @th
preferred label: stromy @sk
preferred label: деревья @ru
preferred label: fa @hu
preferred label: أشجار @ar
preferred label: Baum @de
preferred label: trees @en
preferred label: درختان @fa
preferred label: arbre @fr
preferred label: वृक्ष / पेड़ @hi
preferred label: Alberi @it
preferred label: 樹木 @ja
preferred label: 수목 @ko
preferred label: ຕົ້ນໄມ້ @lo
preferred label: Drzewo @pl
preferred label: árvore @pt
Tiene componente: Hoja

Superficie foliar
type: Concept
preferred label: eneo la majani @sw
preferred label: ფოთლების ზედაპირის ფართობი @ka
preferred label: suprafaţă foliară @ro
preferred label: yaprak alanı @tr
preferred label: 叶面积 @zh
preferred label: พื้นที่ใบ @th
preferred label: listová plocha @sk
preferred label: площадь листовой поверхности @ru
preferred label: منطقة الأوراق @ar
preferred label: Blattfläche @de
preferred label: leaf area @en
preferred label: سطح برگ @fa
preferred label: surface foliaire @fr
preferred label: पर्ण क्षेत्र @hi
preferred label: levélfelület @hu
preferred label: Area fogliare @it
preferred label: 葉面積 @ja
preferred label: 엽면적 @ko
preferred label: Powierzchnia liści @pl
preferred label: área foliar @pt
Está afectado por: Hoja

Nervadura foliar
type: Concept
preferred label: vishipajani @sw
preferred label: жылка ліста @be
preferred label: ფოთლის ძარღვი @ka
preferred label: 叶脉 @zh
preferred label: yaprak damarı @tr
preferred label: เส้นใบ @th
preferred label: listové žily @sk
preferred label: عروق الورق @ar
preferred label: listové cévy @cs
preferred label: Blattader @de
preferred label: leaf veins @en
preferred label: رگبرگ‌های برگ @fa
preferred label: nervure foliaire @fr
preferred label: पर्ण शिरायें @hi
preferred label: levélerezet @hu
preferred label: Nervature @it
preferred label: 葉脈 @ja
preferred label: ກ່າງໃບ @lo
preferred label: Nerwy liścia @pl
preferred label: nervura foliar @pt
preferred label: жилки листа @ru
Es componente de: Hoja

Mesofilo
type: Concept
preferred label: мезафіл @be
preferred label: mesophyll @sw
preferred label: mesofyll @nb
preferred label: mezofil @ro
preferred label: მეზოფილი @ka
preferred label: 叶肉 @zh
preferred label: มีโซฟิลล์ @th
preferred label: mezofyl @sk
preferred label: мезофилл @ru
preferred label: mesofilo @pt
preferred label: نسيج متوسط @ar
preferred label: Mesophyll @de
preferred label: میان‌برگ @fa
preferred label: mésophylle @fr
preferred label: पर्णमध्योतक @hi
preferred label: Mesofillo @it
preferred label: 葉肉 @ja
preferred label: 엽육 @ko
preferred label: ມີໂຊພິລລ @lo
preferred label: Mezofil @pl
Compone: Hoja

Potencial hídrico foliar
type: Concept
preferred label: водны патэнцыял ліста @be
preferred label: uwezo wa maji ya majani @sw
preferred label: водний потенціал листя @uk
preferred label: إمكانات الماء الورقية @ar
preferred label: водни потенцијал листа @sr
preferred label: potenţial hidric foliar @ro
preferred label: yaprak su potansiyeli @tr
preferred label: 叶水势 @zh
preferred label: ระดับน้ำของใบ @th
preferred label: vodní potenciál listu @cs
preferred label: Wasserpotential des Blattes @de
preferred label: leaf water potential @en
preferred label: پتانسيل آب برگ @fa
preferred label: potentiel hydrique foliaire @fr
preferred label: पर्ण जल क्षमता @hi
preferred label: levél vízpotenciálja @hu
preferred label: Potenziale idrico fogliare @it
preferred label: 葉の水ポテンシャル @ja
preferred label: ຄ່າສັກຂອງນ້ຳໃນໃບ @lo
preferred label: Potencjał wodny liścia @pl
preferred label: potencial hídrico foliar @pt
preferred label: водный потенциал листа @ru
is property of: Hoja

Órgano vegetativo de la planta
type: Concept
preferred label: ogani za mimea zilizo vegetative @sw
preferred label: вегетатыўныя органы раслін @be
preferred label: вегетативні органи рослин @uk
preferred label: organe vegetative (plante) @ro
preferred label: bitki büyüme organı @tr
preferred label: 植物生长器官 @zh
preferred label: เนื้อเยื่อพืชส่วนที่ไม่เกี่ยวกับเพศ @th
preferred label: vegetatívne orgány rastlín @sk
preferred label: أعضاء تكاثر النبات الخضري @ar
preferred label: vegetativní orgány rostlin @cs
preferred label: Vegetationsorgan @de
preferred label: plant vegetative organs @en
preferred label: اندام‌های رویشی گیاه @fa
preferred label: organe végétatif des plantes @fr
preferred label: पौध-वानस्पतिक अंग @hi
preferred label: növény vegetatív szerve @hu
preferred label: Organi vegetativi delle piante @it
preferred label: 植物栄養器官 @ja
preferred label: ອະໄວຍະວະບຳລຸງລ້ຽງຂອງພືດ @lo
preferred label: Organ wegetatywny roślin @pl
preferred label: orgão vegetativo das plantas @pt
preferred label: вегетативные органы растений @ru
narrower: Hoja