受...损伤
sub property of: isAffectedBy
comment: ع < يصاب بـ > س. يمكن أن تتأثر صحة أو رفاهية كائن حي أو جزء من الجسم ع سلبًا بالمرض س. "اللسان" <يصاب بـ> "التهاب اللسان". @ar
comment: Y<受...损伤>X。生物体或身体部分Y的健康可能受到疾病X的负面影响。例如：“内分泌腺”<受...损伤>“内分泌病”，“舌”<受...损伤>“舌炎”。
comment: Y <поражается> болезнью X. На здоровье или благополучие организма или части тела Y может негативно повлиять болезнь X. Например, "болезни эндокринной системы" <поражается> "эндокринные железы", "язык" <поражается> "глоссит". @ru
comment: Y <is Afflicted By> X. The health or wellbeing of an organism part Y could adversely be affected by the disease X. E.g. "endocrine glands" <is Afflicted By> "endocrine diseases", “tongue” <is Afflicted By> “glossitis”. @en
comment: Y <está afligido por> X. La salud o el bienestar de una parte del organismo Y podría verse afectado negativamente por la enfermedad X. Ej. "Glándula endocrina" <está afligido por> "Enfermedad endocrina", "Lengua" <está afligido por> "Glositis". @es
comment: Y <est affligé par> X. La santé ou le bien-être d'une partie du organisme Y pourrait être affecté par la maladie ou le désordre X. Par exemple, "glande endocrine" <est affligé par> "trouble endocrinien", "langue" <est affligé par> "glossite". @fr
label: تتأثر ... بـ ... @ar
label: поражается @ru
label: está afligido por @es
label: est affligé par @fr
label: Is afflicted by @en

有病原体
sub property of: causativeRelationship
comment: س <لديه مسببات مرض> ع. الكائن الحي لديه مسببات مرض ع. مسببات الأمراض هي الكائنات الحية الدقيقة المسببة للأمراض مثل الفيروسات والبكتيريا والفطريات على سبيل المثال: "Olea europaea "<لديها مسببات مرض>" Xylella fastidiosa " @ar
comment: X<有病原体>Y。生物体X有病原体Y。病原体指病毒、细菌和真菌等致病性微生物。例如：“Olea europaea”<有病原体>“Xylella fastidiosa”。
comment: X <имеет патоген> Y. Организм X имеет патоген Y. Патогены - это патогенные микроорганизмы, такие как вирусы, бактерии и грибы. Например, "Olea europaea" <имеет патоген> "Xylella fastidiosa". @ru
comment: X <tiene patógeno> Y. El organismo X tiene el patógeno Y. Los patógenos son microorganismos patógenos como virus, bacterias y hongos. Ej. "Olea europaea" <tiene patógeno> "Xylella fastidiosa". @es
comment: X <has pathogen> Y. Organism X has pathogen Y. Pathogens are pathogenic microorganism such as viruses, bacteria and fungi. E.g. "Olea europaea" <has pathogen> "Xylella fastidiosa". @en
comment: X <a l'agent pathogène> Y. L'organisme X a un agent pathogène Y. Les agents pathogènes sont des microorganismes pathogènes tels que : des virus, des bactéries et des champignons. Par exemple, "Olea europaea" <a l'agent pathogène> "Xylella fastidiosa". @fr
label: لديه مسببات الأمراض @ar
label: имеет патоген @ru
label: Tiene patógeno @es
label: Has pathogen @en
label: A l'agent pathogène @fr

有常用名概念
sub property of: taxonomicRelationship
comment: ع <لها مفهوم الاسم الشائع> س. ع هو مفهوم محدد علميًا لكائن حي أو مجموعة من الكائنات الحية التي تحمل اسمًا علميًا كعلامات ، ولها رتبة تصنيفية محددة على سبيل المثال"Apis mellifera". <لها مفهوم الاسم الشائع> "نحل العسل". يستخدم على مستوى المفهوم عندما يكون الاسم الشائع والاسم العلمي مفهومين منفصلين. لعلاقة التسمية إلى التسمية للاستخدام ضمن المفهوم ، استخدم <له اسم علمي / اسم علمي لـ>. @ar
comment: Y<有常用名概念>X。Y是某一生物体或生物群X的学名概念，其标签为学名，具有特定的分类等级。“Apis mellifera”<有常用名概念>“蜜蜂”。当常用名和学名是独立的概念时，在概念层面使用。对于标签间关系，在同一个概念内使用<有学名/是...的学名>。
comment: Y <имеет обиходное название> X. Y - это научно определенное понятие для организма или группы организмов с научным названием в качестве меток, имеющих определенный таксономический ранг. "Apis mellifera" <имеет обиходное название> "медоносные пчелы". Используется на уровне понятия, когда обиходное название и научное название являются отдельными понятиями. Для связи между метками в пределах понятия используйте <имеет научное название/явлется научным названием>. @ru
comment: Y <tiene nombre común del concepto> X. Y es un concepto definido científicamente para un organismo o un grupo de organismos con nombre científico como etiquetas, que tiene un rango taxonómico específico. "Apis mellifera" <tiene nombre común del concepto> "Abeja melífera". Se utiliza a nivel de concepto cuando el nombre común y el nombre científico son conceptos separados. Para la relación de etiqueta a etiqueta para su uso dentro de un concepto, utilice <tiene nombre científico / es el nombre científico de>. @es
comment: Y <has common name concept> X. Y is a scientifically defined concept for an organism or a group of organisms with scientific name as labels, having a specific taxonomic rank. "Apis mellifera” <has common name concept> “honey bees”. Use at concept level when common name and scientific name are separate concepts. For label-to-label relationship for use within a concept, use <has scientific name / scientific name of>. @en
comment: Y <a nom commun de concept> X. Y est un concept scientifiquement défini pour un organisme ou un groupe d'organismes avec des noms scientifiques comme terme, ayant un rang taxonomique spécifique. "Apis mellifera" <a nom commun de concept> "abeille domestique". Utilisation au niveau du concept lorsque le nom commun et le nom scientifique sont des concepts distincts. Pour une relation terme à terme à utiliser dans un concept, utilisez <a nom scientifique/ est le nom scientifique>. @fr
label: له مفهوم الاسم الشائع @ar
label: имеет обиходное название @ru
label: Tiene nombre común del concepto @es
label: Has common name concept @en
label: A nom commun de concept @fr

有分类等级
sub property of: taxonomicRelationship
comment: س <لها مرتبة تصنيفية في> ع. تصف المرتبة التصنيفية ع الكائن الحي س. على سبيل المثال: "Spodoptera frugiperda" <لها مرتبة تصنيفية في> "الأنواع (نظام التصنيف)". @ar
comment: X<有分类等级>Y。描述了生物体X的分类等级Y。例如：“草地贪夜蛾”<有分类等级>“物种(分类单位)”。
comment: X <имеет таксономический ранг> Y. Описывает таксономический ранг Y организма X. "Spodoptera frugiperda" <имеет таксономический ранг> "вид (таксон)". @ru
comment: X <tiene el rango taxonómico> Y. Describe el rango taxonómico Y del organismo X. Ej. "Spodoptera frugiperda" <tiene el rango taxonómico> "Especie (taxón)". @es
comment: X <has taxonomic rank> Y. Describes taxonomic rank Y of organism X. “Spodoptera frugiperda” <has taxonomic rank> “species (taxa)”. @en
comment: X <a le rang taxonomique> Y. Décrit le rang taxonomique Y de l'organisme X. "Spodoptera frugiperda" <a le rang taxonomique> "espèce (taxon)" @fr
label: لديها المرتبة التصنيفية @ar
label: имеет таксономический ранг @ru
label: Tiene el rango taxonómico @es
label: Has taxonomic rank @en
label: A le rang taxonomique @fr

AGROVOC
type: ConceptScheme

Haliotis
type: Label
in dataset: Agrovoc
created: 2024-12-04T11:19:45
notation: 3475

Haliotis
type: Label
in dataset: Agrovoc
created: 2024-01-24T17:58:42Z
notation: 3475

Haliotis
type: Label
in dataset: Agrovoc
created: 2024-01-24T17:44:42Z
notation: 3475

Haliotis
type: Label
in dataset: Agrovoc
created: 2024-01-22T17:21:42Z
notation: 3475

Haliotis
type: Label
in dataset: Agrovoc
created: 2024-01-24T17:10:42Z
notation: 3475

Haliotis
type: Label
in dataset: Agrovoc
created: 2024-01-24T16:40:42Z
notation: 3475

Haliotis
type: Label
in dataset: Agrovoc
created: 2021-10-07T22:30:42Z
notation: 3475

Haliotis
type: Label
in dataset: Agrovoc
created: 2021-09-30T08:50:42Z
notation: 3475

Haliotis
type: Label
in dataset: Agrovoc
created: 2021-07-05T19:30:42Z
notation: 3475

Haliotis
type: Label
in dataset: Agrovoc
created: 2021-05-17T16:50:42Z
notation: 3475

Haliotis
type: Label
in dataset: Agrovoc
created: 2019-05-31T12:20:00.021+01:00
notation: 3475

Haliotis
type: Label
in dataset: Agrovoc
created: 2019-03-25T15:48:00.021+01:00
notation: 3475

Haliotis
type: Label
in dataset: Agrovoc
created: 2019-03-25T15:41:00.021+01:00
notation: 3475

Haliotis
type: Label
in dataset: Agrovoc
created: 2019-02-12T12:52:32.021+01:00
notation: 3475

Haliotis
type: Label
in dataset: Agrovoc
created: 2011-11-20T20:12:52Z
modified: 2011-11-20T20:12:52Z
notation: 3475

鲍属
type: Label
in dataset: Agrovoc
created: 2002-12-12T00:00:00Z
has term type: Taxonomic terms for animals
modified: 2021-08-16T11:30:42Z
notation: 3475

Haliotis
type: Label
in dataset: Agrovoc
created: 2005-08-19T00:00:00Z
has term type: Taxonomic terms for animals
notation: 3475

Haliotis
type: Label
in dataset: Agrovoc
created: 2005-12-16T00:00:00Z
has term type: Taxonomic terms for animals
notation: 3475

Haliotis
type: Label
in dataset: Agrovoc
created: 1998-08-04T00:00:00Z
has term type: Taxonomic terms for animals
notation: 3475

Haliotis
type: Label
in dataset: Agrovoc
created: 2006-12-19T00:00:00Z
has term type: Taxonomic terms for animals
notation: 3475

Haliotis
type: Label
in dataset: Agrovoc
created: 2005-12-16T00:00:00Z
has term type: Taxonomic terms for animals
notation: 3475

ミミガイ属
type: Label
in dataset: Agrovoc
created: 2005-08-09T00:00:00Z
has term type: Taxonomic terms for animals
notation: 3475

Haliotis
type: Label
in dataset: Agrovoc
created: 2006-11-06T00:00:00Z
has term type: Taxonomic terms for animals
notation: 3475

Haliotis
type: Label
in dataset: Agrovoc
created: 2006-12-06T00:00:00Z
has term type: Taxonomic terms for animals
notation: 3475

हैलिओटिस
type: Label
in dataset: Agrovoc
created: 1981-01-09T00:00:00Z
has term type: Taxonomic terms for animals
notation: 3475

Haliotis
type: Label
in dataset: Agrovoc
created: 1981-01-21T00:00:00Z
has term type: Taxonomic terms for animals
notation: 3475

هالیوتیس
type: Label
in dataset: Agrovoc
created: 2007-04-20T00:00:00Z
has term type: Taxonomic terms for animals
notation: 3475

Haliotis
type: Label
in dataset: Agrovoc
created: 1981-01-23T00:00:00Z
has term type: Taxonomic terms for animals
notation: 3475

Haliotis
type: Label
in dataset: Agrovoc
created: 1981-01-09T00:00:00Z
has term type: Taxonomic terms for animals
notation: 3475

Haliotis
type: Label
in dataset: Agrovoc
created: 1996-12-24T00:00:00Z
has term type: Taxonomic terms for animals
notation: 3475

Haliotis
type: Label
in dataset: Agrovoc
created: 2003-03-27T00:00:00Z
has term type: Taxonomic terms for animals
modified: 2013-08-28T22:14:37Z
notation: 3475

هاليوتس
type: Label
in dataset: Agrovoc
created: 2002-12-12T00:00:00Z
has term type: Taxonomic terms for animals
notation: 3475

Haliotis, common name abalone, is the only genus in the family Haliotidae.
has source: Wikipedia, 2024. Haliotis. https://en.wikipedia.org/wiki/Haliotis
created: 2024-08-08T10:28:24

prefLabel
comment: A resource has no more than one value of skos:prefLabel per language tag. @en

鲍属
type: Concept
narrower: 多变鲍
narrower: 平鲍
narrower: 杂色鲍
narrower: 欧洲鲍螺
narrower: 赤鲍
narrower: 圆鲍螺
narrower: 南非鲍螺
narrower: 菲律宾鲍螺
narrower: 大鲍
narrower: 耳鲍
narrower: 螺纹鲍螺
narrower: 白色鲍鱼
narrower: 红鲍
narrower: 孔雀鲍螺
narrower: 黑鲍螺
narrower: 皱鲍
narrower: 盘鲍
受...损伤: 加州立克次体感染
有病原体: Xenohaliotis californiensis
in dataset: Agrovoc
有常用名概念: 鲍鱼
created: 2011-11-20T20:12:52Z
有分类等级: 属
editorial note: Author: Linnaeus, 1758 @en
in scheme: AGROVOC
pref label: Haliotis
pref label: 鲍属
pref label: ミミガイ属
pref label: हैलिओटिस
pref label: هالیوتیس
pref label: هاليوتس
definition: Haliotis, common name abalone, is the only genus in the family Haliotidae.
preferred label: Haliotis @nn
preferred label: هاليوتس @ar
preferred label: هالیوتیس @fa
preferred label: हैलिओटिस @hi
preferred label: ミミガイ属 @ja
modified: 2024-12-04T11:19:46
broader: 鲍科

多变鲍
type: Concept
preferred label: Haliotis varia @th
broader: 鲍属

平鲍
type: Concept
preferred label: Haliotis planata @th
broader: 鲍属

杂色鲍
type: Concept
preferred label: Haliotis diversicolor @th
broader: 鲍属

欧洲鲍螺
type: Concept
preferred label: Haliotis tuberculata @th
broader: 鲍属

赤鲍
type: Concept
preferred label: Haliotis rubra @th
broader: 鲍属

圆鲍螺
type: Concept
preferred label: Haliotis ovina @th
broader: 鲍属

南非鲍螺
type: Concept
preferred label: Haliotis midae @th
broader: 鲍属

菲律宾鲍螺
type: Concept
preferred label: Haliotis glabra @th
broader: 鲍属

大鲍
type: Concept
preferred label: Haliotis gigantea @th
broader: 鲍属

耳鲍
type: Concept
preferred label: Haliotis asinina @th
broader: 鲍属

螺纹鲍螺
type: Concept
preferred label: Haliotis assimilis @th
broader: 鲍属

白色鲍鱼
type: Concept
preferred label: Haliotis sorenseni @th
broader: 鲍属

红鲍
type: Concept
preferred label: Haliotis rufescens @th
broader: 鲍属

孔雀鲍螺
type: Concept
preferred label: Haliotis fulgens @th
broader: 鲍属

黑鲍螺
type: Concept
preferred label: Haliotis cracherodii @th
broader: 鲍属

皱鲍
type: Concept
preferred label: Haliotis corrugata @th
broader: 鲍属

盘鲍
type: Concept
preferred label: Haliotis discus @vi
preferred label: هالیوتیس دیسکوس @fa
preferred label: हैलिओटिस डिस्कस @hi
preferred label: エゾアワビ @ja
preferred label: 전복(학명) @ko
broader: 鲍属

加州立克次体感染
type: Concept
preferred label: Xenohaliotis Californiensis enfeksiyonu @tr
preferred label: kuambukizwa na Xenohaliotis californiensis @sw
preferred label: infection with Xenohaliotis californiensis @ar
preferred label: инфекция Xenohaliotis californiensis @ru
preferred label: infekcija s Xenohaliotis californiensis @hr
preferred label: infectie met Xenohaliotis californiensis @nl
preferred label: infection par Xenohaliotis californiensis @fr
preferred label: Infección por Xenohaliotis californiensis @es
afflicts: 鲍属

Xenohaliotis californiensis
type: Concept
is pathogen of: 鲍属

鲍鱼
type: Concept
preferred label: марскія вушкі @be
preferred label: ureche-de-mare @ro
preferred label: abaloni @sw
preferred label: ჰალიოტისი @ka
preferred label: abaloner @nb
preferred label: అబలోనులు @te
preferred label: denizkulağı (hayvan) @tr
preferred label: หอยเป๋าฮื้อ @th
preferred label: morské slimáky (morské uši) @sk
preferred label: морские ушки @ru
preferred label: orelha-do-mar @pt
preferred label: أذن البحر @ar
preferred label: ušni @cs
preferred label: Seeohr @de
preferred label: abalones @en
preferred label: Oreja de mar @es
preferred label: گوش‌دریاها @fa
preferred label: ormeau @fr
preferred label: एबालोन्स @hi
preferred label: abalone @hu
preferred label: Orecchia marina @it
preferred label: アワビ類 @ja
preferred label: 전복 @ko
preferred label: ຫອຍເປົ້າຮື້ @lo
preferred label: Uchowiec @pl
has taxonomic concept: 鲍属

属
type: Concept
preferred label: jenasi @sw
preferred label: geslacht @nl
preferred label: slægt @da
preferred label: släkte @sv
preferred label: slekt @nn
preferred label: Gènere @ca
preferred label: род @be
preferred label: género @pt
preferred label: gen (taxon) @ro
preferred label: рід @uk
preferred label: გვარი (ტაქსონი) @ka
preferred label: genre (taxon) @fr
preferred label: Género (taxón) @es
preferred label: genus @tr
preferred label: جنس @ar
preferred label: 속 @ko
preferred label: rod @cs
preferred label: Gattung @de
preferred label: سرده @fa
preferred label: वंश @hi
preferred label: nemzettség @hu
preferred label: Genere @it
preferred label: ສະກຸນ (ດຽວ) @lo
preferred label: Genus @pl
is taxonomic rank of: 鲍属

鲍科
type: Concept
preferred label: Haliotidae @th
preferred label: 전복과 @ko
narrower: 鲍属