Affects
comment: س <يؤثر على> ع. أي إجراء من العامل س يؤدي إلى تغيير حالة أو موقع ع على سبيل المثال: "نضوب المياه" <يؤثر على> "منسوب المياه الجوفية" "الضرر الميكانيكي" <يؤثر على> "جودة النقل" لا تستخدم للأمراض أو الاضطرابات. لهؤلاء استخدم <afflicts / isAfflictedBy>. @ar
comment: X<影响> Y。媒介X的行为改变Y的状态或位置。例如：“水枯竭”<影响> “地下水位”，“机械损伤”<影响> “运输性能”。请勿用于疾病或病症；对于疾病和病症，使用<损害/受...损害>。 @zh
comment: X <влияет на> Y. Действие агента X изменяет состояние или местоположение Y. Например, "истощение водных ресурсов" <влияет на> "уровень грунтовых вод", "механические повреждения" <влияют на> "пригодность к транспортировке". Не используйте для болезней или расстройств; для них используйте <поражает/на ... негативно влияет болезнь .....>. @ru
comment: X <affects> Y. Action of agent X changes the state or location of Y. E.g. "water depletion" <affects> "groundwater table", "mechanical damage" <affects> “transporting quality”. Do not use for diseases or disorders; for those, use <afflicts/is afflicted by>.
comment: X <affecte> Y. L'agent X agit sur l'objet Y de telle sorte que Y change d'état ou de localisation. Par exemple, "tarissement" <affecte> "nappe souterraine", "dégât mécanique" <affecte> "aptitude au transport". Ne l'utilisez pas pour des maladies ou des désordres : pour ceux-là, utilisez <afflige/est affligé par>. @fr
comment: X <afecta> Y. La acción del agente X cambia el estado o la ubicación de Y. Ej. "Agotamiento del agua" <afecta> "Capa freática", "Daño mecánico" <afecta> "Aptitud para el transporte". No lo utilice para enfermedades o trastornos; para ellos, utilice <aflige/está afligido por>. @es
label: يؤثر @ar
label: влияет на @ru
label: Affecte @fr
label: Afecta @es
label: 影响 @zh
sub property of: causativeRelationship

Causes
comment: س <يسبب> ع. العامل س (حي أو غير حي) يحقق نتيجة ع. على سبيل المثال: "البريونات" <تسبب> "الاعتلال الدماغي الاسفنجي" "نقص في رطوبة التربة" <يسبب> "الذبول" @ar
comment: X<引起>Y。媒介X（生物或非生物）引起结果Y。例如：“朊病毒”<引起>“海绵状脑病”，“土壤水分亏缺”<引起>“萎蔫”。 @zh
comment: X <вызывает > Y. Агент X (одушевленный или неодушевленный) приводит к результату Y. Например, "прионы" <вызывает> "губкообразная энцефалопатия", "водный дефицит в почве" <вызывает> "увядание". @ru
comment: X <causes> Y. Agent X (animate or inanimate) brings about a result Y. E.g. "prions" <causes> "spongiform encephalopathy", "soil moisture deficit" <causes> "wilting".
comment: X <cause> Y. L'agent X (animé ou inanimé) produit un résultat Y. Par exemple, "prion" <cause> "encéphalopathie spongiforme", "déficit d'humidité du sol" <cause> "fanaison". @fr
comment: X <causa> Y. El agente X (animado o inanimado) provoca un resultado Y. Ej. "Prión" <causa> "Encefalopatía espongiforme", "Déficit de humedad en el suelo" <causa> "Marchitamiento". @es
label: الأسباب @ar
label: вызывает @ru
label: Cause @fr
label: Causa @es
label: 引起关系 @zh
sub property of: causativeRelationship

Has property
comment: س <لديه خاصية> ع. الخاصية قد تكون جودة أو ميزة. على سبيل المثال: البذرة"<لديها خاصية> "حجم البذرة" "النباتات الطبية" <لديها خاصية> "الخصائص الطبية" @ar
comment: X<有属性>Y。属性可以是一种性质或特点。例如：“种子”<有属性>“种子大小”和“种子活力”，“药用植物类” <有属性>“药物属性”。 @zh
comment: X <обладает свойством> Y. Свойство может быть качеством или признаком. Например, "семенной материал" <обладает свойством> "крупность семян", "лекарственные растения" <обладает свойством> "фармакологические свойства". @ru
comment: X <tiene propriedad> Y. Una propiedad puede ser una cualidad o un rasgo. Ej. “Semilla” <tiene propriedad> “Tamaño de la semilla", “Planta medicinal” <tiene propriedad> “Propiedad medicinal”. @es
comment: X <has property> Y. A property might be a quality or trait. E.g. “seed” <has property> “seed size", “medicinal plants” <has property> “medicinal properties”.
comment: X <a la propriété> Y. Une propriété peut être une qualité ou un trait. Par exemple, "semence" <a la propriété> "grosseur des semences", "plante médicinale" <a la propriété> "propriété pharmacologique". @fr
label: 有属性 @zh
label: لديه ممتلكات @ar
label: обладает свойством @ru
label: Tiene propriedad @es
label: A la propriété @fr
sub property of: causativeRelationship

Is affected by
comment: ع <يتأثر بـ >س . يغير الكائن "ع" حالته أو موقعه بسبب إجراء قام به العامل "س". على سبيل المثال. "الأشجار" تتأثر بـ "مبيدات الشجر" ، "جودة النقل" تتأثر "بالضرر الميكانيكي". لا تستخدم للأمراض أو الاضطرابات. لهؤلاء استخدم <afflicts / isAfflictedBy>. @ar
comment: на Y влияет X. Объект Y изменяет состояние или местоположение из-за действия агента X. Например, на "деревья" влияет "арборициды", на "качество транспортировки" влияет "механические повреждения". Не используйте для болезней или расстройств; для них используйте <поражает/на ... негативно влияет болезнь .....>. @ru
comment: Y<受...影响> X。对象Y的状态或位置由于媒介X的行为而发生变化。例如：“树”<受...影响>“树木毒杀剂”，“运输性能”<受...影响>“机械损伤”。 请勿用于疾病或病症；对于疾病和病症，使用<损伤/受...损伤>。 @zh
comment: Y <is affected by> X. An object Y changes state or location because of an action of an agent X. E.g. "trees" <is affected by> "arboricides", "transporting quality" <is affected by> "mechanical damage". Do not use for diseases or disorders; for those, use <afflicts/is afflicted by>.
comment: Y <está afectado por> X. Un objeto Y cambia de estado o ubicación debido a la acción de un agente X. Ej. "Árbol" <está afectado por> "Arboricida", "Aptitud para el transporte" <está afectado por> "Daño mecánico". No lo utilice para enfermedades o trastornos; para ellos, utilice <aflige/está afligido por>. @es
comment: Y <est affecté par> X. Un objet Y change d'état ou de localisation suite à l'action d'un agent X. Par exemple, "arbre" <est affecté par> "arboricide", "aptitude au transport" <est affecté par> "dégât mécanique". Ne l'utilisez pas pour des maladies ou des désordres: pour ceux-là, utilisez <afflige/est affligé par>. @fr
label: 受...影响 @zh
label: يتأثر بها @ar
label: на ... влияет .... @ru
label: Está afectado por @es
label: Est affecté par @fr
sub property of: causativeRelationship

Is caused by
comment: ع <سببه> س. النتيجة ع تحدث بسبب العامل س (الحي أو غير الحي) على سبيل المثال: "الاعتلال الدماغي الاسفنجي" <سببه> "البريونات" الذبول" <سببه> "النقص في رطوبة التربة" @ar
comment: Y<由...引起>X。结果Y由于媒介X（生物或非生物）而发生。例如：“海绵状脑病”<由...引起>“朊病毒”，“萎蔫”<由...引起>“土壤水分亏缺”。 @zh
comment: Y <вызывается> X. Результат Y произошел из-за агента X (одушевленного или неодушевленного). Например, "губчатая энцефалопатия" <вызывается> "прионы", "увядание" <вызывается> "дефицит влажности почвы". @ru
comment: Y <is caused by> X. A result Y occurred because of an agent X (animate or inanimate). E.g. "spongiform encephalopathy" <is caused by> “prions”, "soil moisture deficit” <is caused by> "wilting".
comment: Y <está causado por> X. Un resultado Y se produjo debido a un agente X (animado o inanimado). Ej. "Encefalopatía espongiforme" <está causado por> "Prión", "Marchitamiento" <está causado por> "Déficit de humedad en el suelo". @es
comment: Y <est causée par> X. Un résultat Y s'est produit à cause d'un agent X (animé ou inanimé). Par exemple, "encéphalopathie spongiforme" <est causée par> "prion", "fanaison" <est causée par> "déficit d'humidité du sol". @fr
label: 由...引起 @zh
label: هو سبب @ar
label: вызывается @ru
label: Está causado por @es
label: Est causée par @fr
sub property of: causativeRelationship

Is component of
comment: س <هي مكون من> ع. الكائن س هو جزء من ع بالكامل وله أيضاً وجود مستقل عن ع. على سبيل المثال: "الورقة" <هي مكون من > "الشجرة" " المحركات" <هي مكون من > "منظومات المركبات". @ar
comment: X <является компонентом> Y. Объект X, который является частью целого Y, также имеет существование независимо от Y. Например, "листья" <является компонентом> "деревья", "двигатели" <является компонентом> "системы машин". @ru
comment: X <est un composant de> Y. Un objet X qui fait partie d'un Y entier, a également une existence indépendante de Y. Par exemple, "feuille" <est un composant de> "arbre", "moteur" <est un composant de> "organe de véhicule" . @fr
comment: X <es componente de> Y. Un objeto X que forma parte de un conjunto Y, también tiene una existencia independiente de Y. Ej. "Hoja" <es componente de> "Árbol", "Motore" <es componente de> "Componente del vehículo". @es
comment: X<是...的组成部分>Y。物体X是整体Y的一部分，同时也独立于Y存在。例如：“叶”<是...的组成部分>“树”，“发动机”<是...的组成部分>“车辆系统”。 @zh
comment: X <is component of> Y. An object X that is a part of a whole Y, also has an existence independently from Y. E.g. "leaves" <is component of> "trees", "engines" <is component of> "vehicle systems".
label: 是...的组成部分 @zh
label: هو مكون من @ar
label: является компонентом @ru
label: Est un composant de @fr
label: Es componente de @es
sub property of: isPartOf

Is included in
comment: ع <متضمن في> س. س هو كيان يتضمن العنصر ع على سبيل المثال: "عملية إزالة القرون" <متضمنة في>"طرق رعاية الحيوان" " تخصيص الموارد" <متضمنة في> "تحليل المياه" @ar
comment: Y<包含于>X。实体X包含元素Y。例如：“断角术”<包含于>“家畜饲养方法”，“微生物分析”<包含于>“水分析”。 @zh
comment: Y <включен в> X. X - это сущность, которая включена в элемент Y. Например, "удаление рогов" <включен в> "методы выращивания и содержания животных", "микробиологический анализ" <включен в> "анализ воды". @ru
comment: Y <is included in>X. X is an entity that includes the element Y. For example: "dehorning” <included in> ”animal husbandry methods”, “microbiological analysis" <included in> “water analysis”
comment: Y <incluido en>X. X es una entidad que incluye el elemento Y. Ej. "Descorne" <incluido en> "Método de crianza", "Análisis microbiológico" <incluido en> "Análisis de agua". @es
comment: X <est inclus dans> Y. X est une entité qui inclut l'élément Y. Par exemple, "écornage" <est inclus dans> "méthode d'élevage", "analyse microbiologique" <est inclus dans> "analyse de l'eau". @fr
label: 包含于 @zh
label: مدرج في @ar
label: включен в @ru
label: Incluido en @es
label: Est inclus dans @fr
sub property of: partitiveRelationship

Is measured by
comment: س <تُقاس من قبل> ع. يتم قياس خاصية الكمية لـ س بواسطة ع على سبيل المثال: "الحرارة" <تُقاس من قبل> "ميزان الحرارة" التغير الاجتماعي <يُقاس من قبل> " المؤشرات الاجتماعية" @ar
comment: X<由...测量>Y。X数量方面的属性由Y测量。例如：“温度”<由...测量>“体温计”，“社会变迁”<由...测量>“社会指标”。 @zh
comment: X <измеряется> Y. Количественное свойство X измеряется Y. Например, "температура" <измеряется> "термометры", "социальные изменения" <измеряется> "социальные показатели". @ru
comment: X <si mide mediante> Y. Una propiedad cuantitativa de X se mide con Y. Ej. “Temperatura” <si mide mediante> “Termómetro”, “Cambio social” <si mide mediante> "Indicadores sociales". @es
comment: X <is measured by> Y. A quantitative property of X is measured by Y. For example: “temperature” <is measured by> “thermometers”, “social change” <is measured by> “social indicators".
comment: X <est mesuré par> Y. Une propriété quantitative de X est mesurée par Y. Par exemple : "température" <est mesuré par> "thermomètre", "changement social" <est mesuré par> "indicateur social". @fr
label: 由...测量 @zh
label: يتم قياس x بواسطة y @ar
label: измеряется @ru
label: Si mide mediante @es
label: Est mesuré par @fr
sub property of: quantitativeRelationship

Is studied by
comment: س <تُدرس من قبل> ع. يتم دراسة المفهوم س حسب المجال أو العلم أو المجموعة ع. على سبيل المثال "علم الحفريات" <تمت دراسته من قبل> "علماء الحفريات" "ظروف العمل" <تمت دراستها من قبل>" بيئة العمل @ar
comment: X<被...研究>Y。概念X是领域、科学或组群Y的研究对象。例如：“古生物学”<被...研究>“古生物学家”，“工作条件”<被...研究>“人机工程学”。 @zh
comment: X <изучается> Y. Понятие X изучается областью знаний, наукой или группой людей Y. Например, "палеонтология" <изучается> "палеонтологи", "условия труда" <изучается> "эргономика". @ru
comment: X <is studied by> Y. Concept X is studied by field, science or group Y. E.g. “palaeontology”<is studied by> "palaeontologists”, “working conditions” <is studied by> “ergonomics”.
comment: X <est étudié par> Y. Le concept X est étudié par domaine, science ou groupe Y. Par exemple, "paléontologie" <est étudié par> "paléontologue", "condition de travail" <est étudié par> "ergonomie". @fr
comment: X <es estudiado por > Y. El concepto X es estudiado por el campo, la ciencia o el grupo Y. Ej. “Paleontología” <es estudiado por> "Paleontólogo”, “Condiciones de trabajo” <es estudiado por> “Ergonomía”. @es
label: 被...研究 @zh
label: تدرس من قبل @ar
label: Est étudié par @fr
label: Es estudiado por @es
label: <изучается> @ru
sub property of: processRelationship

AGROVOC
type: ConceptScheme

hydrological cycle
type: Concept
has component: precipitation
preferred label: ciclo hidrológico @pt-br
preferred label: mzunguko wa hydrolojia @sw
preferred label: ciclu hidrologic @ro
preferred label: globaler Wasserkreislauf @de
preferred label: ჰიდროლოგიური ციკლი @ka
preferred label: జల చక్రం @te
preferred label: hidrolojik çevrim @tr
preferred label: 水分循环 @zh
preferred label: วัฏจักรของน้ำ @th
preferred label: obeh vody v prírode @sk
preferred label: دورة المياه @ar
preferred label: koloběh vody @cs
preferred label: Ciclo hidrológico @es
preferred label: چرخه آب‌‌شناختی @fa
preferred label: cycle hydrologique @fr
preferred label: जलीय चक्र @hi
preferred label: hidrológiai ciklus @hu
preferred label: Ciclo idrologico @it
preferred label: 水文循環 @ja
preferred label: ວົງຈອນນ້ຳ @lo
preferred label: Cykl hydrologiczny @pl
preferred label: гидрологический цикл @ru

weather
type: Concept
has component: precipitation
preferred label: tempo atmosférico @pt-br
preferred label: hali ya hewa @sw
preferred label: vêr @nn
preferred label: vær @nb
preferred label: ამინდი @ka
preferred label: vreme @ro
preferred label: hava durumu @tr
preferred label: 天气 @zh
preferred label: สภาพอากาศ @th
preferred label: počasie @sk
preferred label: погода @ru
preferred label: طقس @ar
preferred label: počasí @cs
preferred label: Wetter @de
preferred label: Tiempo meteorológico @es
preferred label: وضع هوا @fa
preferred label: temps météorologique @fr
preferred label: मौसम @hi
preferred label: idõjárás @hu
preferred label: Tempo meteorologico @it
preferred label: 天気 @ja
preferred label: 기상 @ko
preferred label: Pogoda @pl
preferred label: tempo meteorológico @pt

clouds
type: Concept
Causes: precipitation
preferred label: Nube @es
preferred label: mawingu @sw
preferred label: nuvem @pt-br
preferred label: ღრუბელი @ka
preferred label: облаци @sr
preferred label: skyer @nn
preferred label: moln @sv
preferred label: Núvols @ca
preferred label: bulut @tr
preferred label: 云 @zh
preferred label: เมฆ @th
preferred label: oblaky @sk
preferred label: облака @ru
preferred label: غيوم @ar
preferred label: oblaka @cs
preferred label: Wolke @de
preferred label: ابرها @fa
preferred label: nuage @fr
preferred label: मेघ / बादल @hi
preferred label: felhõ @hu
preferred label: Nubi @it
preferred label: 雲 @ja
preferred label: 구름 @ko
preferred label: ເມກ @lo
preferred label: Chmura @pl

groundwater recharge
type: Concept
has component: precipitation
preferred label: kujaza maji ya ardhini @sw
preferred label: yeraltı suyu zenginleşmesi @tr
preferred label: 地下水回灌 @zh
preferred label: การเพิ่มของน้ำใต้ดิน @th
preferred label: obnovenie zásob podzemnej vody @sk
preferred label: подпитывание грунтовых вод @ru
preferred label: recarga do lençol freático @pt
preferred label: حقن المياه الجوفية @ar
preferred label: obnovení zásob podzemní vody @cs
preferred label: Grundwasseranreicherung @de
preferred label: Recarga de aguas subterráneas @es
preferred label: تغذیه آب زیرزمینی @fa
preferred label: recharge de la nappe @fr
preferred label: भूमिगत जल पुर्नभण्डारण @hi
preferred label: talajvíz pótlása @hu
preferred label: Ricarica della falda freatica @it
preferred label: 地下水涵養 @ja
preferred label: 지하수함양 @ko
preferred label: ການເພີ່ມຂອງນ້ຳໃຕ້ດິນ @lo
preferred label: Zasilanie wód podziemnych @pl

precipitation deficit
type: Concept
is property of: precipitation
preferred label: déficit de precipitação @pt-br
preferred label: harara wa upungufu @sw
preferred label: yağış eksikliği @tr
preferred label: 雨量亏缺 @zh
preferred label: ฝนทิ้งช่วง @th
preferred label: zrážkový deficit @sk
preferred label: дефицит осадков @ru
preferred label: نقص الترسيب @ar
preferred label: srážkový deficit @cs
preferred label: Niederschlagsdefizit @de
preferred label: Déficit pluviómetrico @es
preferred label: کمبود بارش @fa
preferred label: déficit pluviométrique @fr
preferred label: वर्षण -कमी @hi
preferred label: csapadékhiány @hu
preferred label: Deficit di precipitazione @it
preferred label: 降水不足 @ja
preferred label: ຝົນຖິ້ມຊ່ວງ @lo
preferred label: Deficyt opadów atmosferycznych @pl
preferred label: deficit pluviométrico @pt

meteorological factors
type: Concept
includes: precipitation
preferred label: Condición atmosférica @es
preferred label: wakili ya hali ya hewa @sw
preferred label: fator meteorológico @pt-br
preferred label: метеоролошки фактори @sr
preferred label: factori meteorologici @ro
preferred label: მეტეოროლოგიური ფაქტორი @ka
preferred label: meteorolojik faktör @tr
preferred label: 气象因素 @zh
preferred label: ปัจจัยทางอุตุนิยมวิทยา @th
preferred label: meteorologické faktory @sk
preferred label: عوامل ميتورولوجية @ar
preferred label: meteorologischer Faktor @de
preferred label: فاکتورهای هواشناختی @fa
preferred label: condition météorologique @fr
preferred label: मौसम विज्ञान कारक @hi
preferred label: meteorológiai tényezõ @hu
preferred label: Fattori meteorologici @it
preferred label: 気象因子、気象要素 @ja
preferred label: ປັດໄຈທາງອຸຕຸນິຍົມວິທະຍາ @lo
preferred label: Warunki meteorologiczne @pl
preferred label: condições meteorológicas @pt
preferred label: метеорологические факторы @ru

pluviometria
type: Concept
measures: precipitation
preferred label: قياس هطول الأمطار @ar
preferred label: pluviometrie @ro
preferred label: yağış ölçümü @tr
preferred label: 雨量测定法 @zh
preferred label: pluviometry
preferred label: Pluviometrie @de
preferred label: Pluviometría @es
preferred label: باران‌سنجي @fa
preferred label: pluviométrie @fr
preferred label: वर्षामापी @hi
preferred label: Pluviometria @it
preferred label: 雨量測定 @ja
preferred label: Pluwiometria @pl
preferred label: плювиометрия @ru
preferred label: pluviometre @sk
preferred label: การวัดปริมาณน้ำฝน @th

water levels
type: Concept
Is affected by: precipitation
preferred label: mực nước @vi
preferred label: vina vya maji @sw
preferred label: водостај @sr
preferred label: წყლის დონე @ka
preferred label: nivelul apei @ro
preferred label: рівні води @uk
preferred label: su seviyesi @tr
preferred label: 水位 @zh
preferred label: ระดับน้ำ @th
preferred label: hladina vody @sk
preferred label: уровень воды @ru
preferred label: منسوب المياه @ar
preferred label: Wasserstand @de
preferred label: Nivel del agua @es
preferred label: ترازهای آب @fa
preferred label: hauteur des eaux @fr
preferred label: जल स्तर @hi
preferred label: vízszint @hu
preferred label: Livelli idrici @it
preferred label: ລະດັບນ້ຳ @lo
preferred label: Poziom wody @pl
preferred label: nível da água @pt

flooding
type: Concept
Is caused by: precipitation
preferred label: inundação @pt-br
preferred label: lũ @vi
preferred label: oversvømmelse @nb
preferred label: mafuriko @sw
preferred label: поплаве @sr
preferred label: затоплення @uk
preferred label: inundație @ro
preferred label: వెల్లువ @te
preferred label: sel baskını @tr
preferred label: 水灾 @zh
preferred label: น้ำท่วม @th
preferred label: povodňové záplavy @sk
preferred label: затопление @ru
preferred label: 洪水 @ja
preferred label: فيضان @ar
preferred label: Überschwemmung @de
preferred label: Inundación @es
preferred label: سیلاب @fa
preferred label: inondation @fr
preferred label: अधि सिंचन @hi
preferred label: áradás @hu
preferred label: Inondazione @it
preferred label: 홍수 @ko
preferred label: ນ້ຳຖ້ວມ @lo
preferred label: Powódź @pl

hydrometeors
type: Concept
narrower: precipitation
preferred label: hidrometeoro @pt
preferred label: hydrométéore @fr
preferred label: гидрометеоры @ru
preferred label: الظواهر الجوية المائية @ar
preferred label: 水凝物 @zh
preferred label: Hydrometeor @de
preferred label: hidrometeor @tr
preferred label: hydrometeor @cs
preferred label: hidrometeori @ro
preferred label: Hidrometeoro @es
preferred label: ჰიდრომეტეორი @ka
preferred label: Idrometeore @it

hail
type: Concept
broader: precipitation
preferred label: granizo @pt-br
preferred label: mvua ya mawe @sw
preferred label: grindină @ro
preferred label: град @sr
preferred label: hagl @nb
preferred label: სეტყვა @ka
preferred label: వాడగల్లు @te
preferred label: dolu @tr
preferred label: 冰雹 @zh
preferred label: ลูกเห็บ @th
preferred label: krúpy [meteorol.] @sk
preferred label: برد (ترسيب) @ar
preferred label: kroupy (meteorol.) @cs
preferred label: Hagel @de
preferred label: Granizo @es
preferred label: تگرگ @fa
preferred label: grêle @fr
preferred label: ओला @hi
preferred label: jégesõ @hu
preferred label: Grandine @it
preferred label: ひょう @ja
preferred label: 우박 @ko
preferred label: ໝາກເຫັບ @lo
preferred label: Grad @pl

hydrology
type: Concept
study: precipitation
preferred label: хидрологија @sr
preferred label: Hidrologia @pt-br
preferred label: hydrologia @sw
preferred label: hydrologi @nb
preferred label: гідрологія @uk
preferred label: hidrologie @ro
preferred label: ჰიდროლოგია @ka
preferred label: జల రాశి శాస్త్రం @te
preferred label: hidroloji @tr
preferred label: 水文学 @zh
preferred label: อุทกวิทยา @th
preferred label: hydrológia @sk
preferred label: гидрология @ru
preferred label: هيدرولوجيا @ar
preferred label: hydrologie @cs
preferred label: Hydrologie @de
preferred label: Hidrología @es
preferred label: آب‌شناسی @fa
preferred label: जल विज्ञान @hi
preferred label: hidrológia @hu
preferred label: Idrologia @it
preferred label: 수문학 @ko
preferred label: ອຸທົກວິທະຍາ @lo
preferred label: Hydrologia @pl

hydrometeorology
type: Concept
study: precipitation
preferred label: хидрометеорологија @sr
preferred label: Hidrometeorologia @pt-br
preferred label: hydrometeorologia @sw
preferred label: الأرصاد الجوية المائية @ar
preferred label: ჰიდრომეტეოროლოგია @ka
preferred label: гідрометеорологія @uk
preferred label: hidrometeorologie @ro
preferred label: జల వాతావరణ శాస్త్రం @te
preferred label: hidrometeoroloji @tr
preferred label: 水文气象学 @zh
preferred label: อุตุนิยมวิทยาอุทก @th
preferred label: hydrometeorológia @sk
preferred label: гидрометеорология @ru
preferred label: hydrometeorologie @cs
preferred label: Hydrometeorologie @de
preferred label: Hidrometeorología @es
preferred label: آب‌هواشناسي @fa
preferred label: hydrométéorologie @fr
preferred label: जल मौसम विज्ञान @hi
preferred label: hidrometeorológia @hu
preferred label: Idrometeorologia @it
preferred label: 水文気象学 @ja
preferred label: 수문기상학 @ko
preferred label: ອຸຕຸນິຍົມທາງອຸທົກກະສາດ @lo
preferred label: Hydrometeorologia @pl

precipitation
type: Concept
Affects: water erosion
Affects: water levels
Affects: soil water balance
Causes: flooding
Has property: precipitation deficit
Is affected by: storms
Is caused by: clouds
Is component of: groundwater recharge
Is component of: hydrological cycle
Is component of: weather
Is included in: meteorological factors
Is measured by: pluviometria
Is studied by: hydrometeorology
Is studied by: hydrology
created: 2011-11-20T20:56:36Z
modified: 2025-07-24T07:53:17
in dataset: Agrovoc
alternative label: yağış yüksekliği @tr
alternative label: harara @sw
alternative label: 降水状況 @ja
alternative label: Niederschlagsform @de
alternative label: 降水性 @ja
alternative label: Warunki precypitacji @pl
alternative label: csapadékháztartás @hu
alternative label: количество осадков @ru
alternative label: 降水量 @zh
alternative label: ปริมาณน้ำฟ้า @th
alternative label: 강수량 @ko
broader: hydrometeors
definition: xDef 90a8b364
definition: Any or all of the forms of water, whether liquid (i.e., rain or drizzle) or solid (e.g., snow or hail), that fall from the atmosphere and reach the ground.
in scheme: AGROVOC
narrower: snow
narrower: rain
narrower: artificial precipitation
narrower: hail
preferred label: haraka nyingi @sw
preferred label: ატმოსფერული ნალექი @ka
preferred label: precipitação atmosférica @pt-br
preferred label: падавине @sr
preferred label: nedbør @nb
preferred label: precipitaţii atmosferice @ro
preferred label: yağış @tr
preferred label: 降水 @zh
preferred label: น้ำฟ้า @th
preferred label: zrážky @sk
preferred label: атмосферные осадки @ru
preferred label: Opad atmosferyczny @pl
preferred label: هطول @ar
preferred label: srážky @cs
preferred label: Niederschlag @de
preferred label: Precipitación atmosférica @es
preferred label: بارش @fa
preferred label: précipitation @fr
preferred label: अवक्षेपण @hi
preferred label: csapadék @hu
preferred label: Precipitazione @it
preferred label: 강수 @ko
preferred label: ນ້ຳຕົກຈາກຟ້າ @lo
related: precipitation day
scope note: Meteorologisch @de
scope note: Meteorolojik @tr
scope note: เกี่ยวกับอุตุนิยมวิทยา เกี่ยวกับปรากฎการณ์ในบรรยากาศ @th
scope note: ກ່ຽວກັບອຸຕຸນິຍົມວິທະຍາ @lo
scope note: Meteorologica @it
scope note: Meteorológiai @hu
scope note: Météorologique @fr
scope note: Meteorological
scope note: meteorologické @cs
scope note: هواشناسی @fa
alt label: yağış yüksekliği
alt label: harara
alt label: 降水状況
alt label: Niederschlagsform
alt label: 降水性
alt label: Warunki precypitacji
alt label: csapadékháztartás
alt label: количество осадков
alt label: 降水量

artificial precipitation
type: Concept
broader: precipitation
preferred label: haraka nyingi ya bandia @sw
preferred label: precipitação artificial @pt-br
preferred label: вештачке падавине @sr
preferred label: kunstig nedbør @nn
preferred label: precipitaţii artificiale @ro
preferred label: ప్రేరిత వర్షం @te
preferred label: yapay yağış @tr
preferred label: 人工降水 @zh
preferred label: ฝนเทียม @th
preferred label: umelé zrážky @sk
preferred label: искусственные осадки @ru
preferred label: تساقط إصطناعي @ar
preferred label: umělé srážky @cs
preferred label: künstlicher Niederschlag @de
preferred label: Precipitación artificial @es
preferred label: بارش مصنوعی @fa
preferred label: précipitation artificielle @fr
preferred label: कृतिम अवक्षेप @hi
preferred label: mesterséges csapadék @hu
preferred label: Precipitazione artificiale @it
preferred label: 人工降雨 @ja
preferred label: 인공강수 @ko
preferred label: ຝົນທຽມ @lo
preferred label: Opad sztuczny @pl

rain
type: Concept
broader: precipitation
preferred label: წვიმა @ka
preferred label: mvua @sw
preferred label: chuva @pt-br
preferred label: киша @sr
preferred label: ploaie @ro
preferred label: regn @nb
preferred label: yağmur @tr
preferred label: 雨 @zh
preferred label: ฝน @th
preferred label: dážď @sk
preferred label: дождь @ru
preferred label: مطر @ar
preferred label: déšť @cs
preferred label: Regen @de
preferred label: Lluvia @es
preferred label: باران @fa
preferred label: pluie @fr
preferred label: वर्षा @hi
preferred label: esõ @hu
preferred label: Pioggia @it
preferred label: 비 @ko
preferred label: ຝົນ @lo
preferred label: Deszcz @pl

snow
type: Concept
broader: precipitation
preferred label: theluji @sw
preferred label: neve @pt-br
preferred label: снег @sr
preferred label: zăpadă @ro
preferred label: snø @nn
preferred label: თოვლი @ka
preferred label: kar (meteoroloji) @tr
preferred label: 雪 @zh
preferred label: หิมะ @th
preferred label: sneh @sk
preferred label: 눈 @ko
preferred label: ثلج @ar
preferred label: sníh @cs
preferred label: Schnee @de
preferred label: Nieve @es
preferred label: برف @fa
preferred label: neige @fr
preferred label: हिम या बर्फ @hi
preferred label: hó @hu
preferred label: Neve @it
preferred label: ຫິມະ @lo
preferred label: Śnieg @pl

soil water balance
type: Concept
Is affected by: precipitation
preferred label: balanço hídrico do solo @pt-br
preferred label: usawa wa maji ya udongo @sw
preferred label: bilanț hidric al solului @ro
preferred label: toprak su dengesi @tr
preferred label: 土壤水分平衡 @zh
preferred label: ความสมดุลของน้ำในดิน @th
preferred label: bilancia pôdnej vody @sk
preferred label: водный баланс почвы @ru
preferred label: توازن التربة والماء @ar
preferred label: bilance půdní vody @cs
preferred label: Bodenwasserbilanz @de
preferred label: Balance hídrico del suelo @es
preferred label: موازنه آب خاک @fa
preferred label: bilan hydrique du sol @fr
preferred label: मृदा जल संतुलन @hi
preferred label: talajvízmérleg @hu
preferred label: Bilancio idrico del suolo @it
preferred label: 土壌水収支 @ja
preferred label: 토양수분수지 @ko
preferred label: ຄວາມດຸ່ນດ່ຽງຂອງນ້ຳໃນດິນ @lo
preferred label: Bilans wodny gleby @pl

storms
type: Concept
Affects: precipitation
preferred label: Tormenta @es
preferred label: bão @vi
preferred label: dhoruba @sw
preferred label: furtuni @ro
preferred label: fırtına @tr
preferred label: 风暴 @zh
preferred label: พายุ @th
preferred label: búrky @sk
preferred label: штормы @ru
preferred label: عواصف @ar
preferred label: bouře @cs
preferred label: Sturm @de
preferred label: توفان‌ها @fa
preferred label: tempête @fr
preferred label: तूफान या झंझावात @hi
preferred label: vihar @hu
preferred label: Temporali @it
preferred label: 暴風雨 @ja
preferred label: 폭풍 @ko
preferred label: ພະຍຸ @lo
preferred label: Burza @pl
preferred label: tempestade @pt

water erosion
type: Concept
Is affected by: precipitation
preferred label: mmomonyoko wa maji @sw
preferred label: eroziune hidrică @ro
preferred label: წყლისმიერი ეროზია @ka
preferred label: erosione provocata dall'acqua @it
preferred label: Erosión hídrica @es
preferred label: اجراف بفعل الماء @ar
preferred label: su erozyonu @tr
preferred label: 水蚀 @zh
preferred label: การกร่อนโดยน้ำ @th
preferred label: जल क्षरण @hi
preferred label: vodní eroze @cs
preferred label: Wassererosion @de
preferred label: فرسایش آبی @fa
preferred label: érosion hydrique @fr
preferred label: vízerózió @hu
preferred label: 水食 @ja
preferred label: 수식 @ko
preferred label: ການເຊາະເຈື່ອນດ້ວຍນ້ຳ @lo
preferred label: Erozja wodna @pl
preferred label: erosão hídrica @pt
preferred label: водная эрозия @ru
preferred label: vodná erózia @sk

precipitation day
type: Concept
preferred label: дощові дні @uk
preferred label: يوم هطول الأمطار @ar
preferred label: dia de precipitação @pt-br
preferred label: siku ya mvua @sw
preferred label: 降水日 @zh
preferred label: zile cu precipitaţii @ro
preferred label: yağışlı gün @tr
preferred label: Niederschlagstag @de
preferred label: روز بارش @fa
preferred label: वर्षण दिन @hi
preferred label: วันที่มีน้ำฟ้า @th
preferred label: srážkový den @cs
preferred label: ມື້ນ້ຳຕົກຈາກຟ້າ @lo
preferred label: zrážkový deň @sk
preferred label: Giorni di precipitazione @it
preferred label: csapadékos nap @hu
preferred label: dias de precipitação @pt
preferred label: Dni deszczowe @pl
preferred label: jour de précipitation @fr
preferred label: дни с осадками @ru
preferred label: Día de precipitación @es
related: precipitation

Any or all of the forms of water, whether liquid (i.e., rain or drizzle) or solid (e.g., snow or hail), that fall from the atmosphere and reach the ground.
has source: FAOTERM
created: 2022-07-08T16:05:57

xDef 90a8b364
created: 2024-09-11T10:59:19
source: terim.tuba.gov.tr
value: Yatay bir yüzeye düşen ve düştüğü yerde kalarak biriktiği kabul edilen her türlü yağışın yol açtığı ve su eşdeğeri olarak hesaplanan su sütununun genellikle 1 metre karelik alanda belli bir zaman aralığında mm ya da kg cinsinden hesaplanan yüksekliği. @tr

هطول
type: Label
created: 2002-12-12T00:00:00Z
in dataset: Agrovoc
notation: 6161

srážky
type: Label
created: 2003-03-27T00:00:00Z
in dataset: Agrovoc
notation: 6161

Niederschlag
type: Label
created: 1996-12-24T00:00:00Z
in dataset: Agrovoc
notation: 6161

Niederschlagsform
type: Label
created: 1997-06-12T00:00:00Z
in dataset: Agrovoc
notation: 29575

precipitation
type: Label
created: 1981-01-09T00:00:00Z
in dataset: Agrovoc
notation: 6161

Precipitación atmosférica
type: Label
created: 1981-01-23T00:00:00Z
in dataset: Agrovoc
notation: 6161

بارش
type: Label
created: 2007-04-20T00:00:00Z
in dataset: Agrovoc
notation: 6161

précipitation
type: Label
created: 1981-01-21T00:00:00Z
modified: 2021-05-24T17:34:42Z
in dataset: Agrovoc
notation: 6161

अवक्षेपण
type: Label
created: 1981-01-09T00:00:00Z
in dataset: Agrovoc
notation: 6161

csapadék
type: Label
created: 2006-12-06T00:00:00Z
in dataset: Agrovoc
notation: 6161

csapadékháztartás
type: Label
created: 2006-12-06T00:00:00Z
in dataset: Agrovoc
notation: 29575

Precipitazione
type: Label
created: 2006-12-18T00:00:00Z
in dataset: Agrovoc
notation: 6161

降水状況
type: Label
created: 2022-08-09T15:31:36
in dataset: Agrovoc
notation: 01fbd9ce

降水
type: Label
created: 2005-08-09T00:00:00Z
in dataset: Agrovoc
notation: 6161

降水性
type: Label
created: 2005-08-09T00:00:00Z
modified: 2022-08-09T15:31:27
in dataset: Agrovoc
notation: 29575

ატმოსფერული ნალექი
type: Label
created: 2023-10-24T20:58:28
in dataset: Agrovoc
notation: 6161

강수
type: Label
created: 2009-12-02T00:00:00Z
in dataset: Agrovoc
notation: 6161

강수량
type: Label
created: 2009-12-02T00:00:00Z
in dataset: Agrovoc
notation: 29544

ນ້ຳຕົກຈາກຟ້າ
type: Label
created: 2005-12-16T00:00:00Z
in dataset: Agrovoc
notation: 6161

nedbør
type: Label
created: 2019-12-20T17:44:45.45+01:00
in dataset: Agrovoc
notation: 6161

Opad atmosferyczny
type: Label
created: 2006-12-19T00:00:00Z
in dataset: Agrovoc
notation: 6161

Warunki precypitacji
type: Label
created: 2006-12-19T00:00:00Z
in dataset: Agrovoc
notation: 29575

precipitação atmosférica
type: Label
created: 2022-03-21T20:13:05
in dataset: Agrovoc
notation: 6161

precipitação atmosférica
type: Label
created: 1998-08-04T00:00:00Z
modified: 2021-06-16T21:24:42Z
in dataset: Agrovoc
notation: 6161

precipitaţii atmosferice
type: Label
created: 2016-01-29T11:44:35Z
modified: 2016-07-11T20:35:24Z
in dataset: Agrovoc
notation: 6161

атмосферные осадки
type: Label
created: 2009-01-15T00:00:00Z
in dataset: Agrovoc
notation: 6161

количество осадков
type: Label
created: 2009-01-15T00:00:00Z
in dataset: Agrovoc
notation: 29544

zrážky
type: Label
created: 2005-12-16T00:00:00Z
in dataset: Agrovoc
notation: 6161

падавине
type: Label
created: 2020-08-11T09:31:49.57+02:00
in dataset: Agrovoc
notation: 6161

haraka nyingi
type: Label
created: 2023-11-29T14:50:42Z
in dataset: Agrovoc
notation: 6161

harara
type: Label
created: 2023-11-29T14:50:42Z
in dataset: Agrovoc
notation: 89d1e33b

น้ำฟ้า
type: Label
created: 2005-08-19T00:00:00Z
in dataset: Agrovoc
notation: 6161

ปริมาณน้ำฟ้า
type: Label
created: 2005-08-19T00:00:00Z
in dataset: Agrovoc
notation: 29544

yağış
type: Label
created: 2011-11-20T20:21:30Z
modified: 2013-08-27T17:52:14Z
in dataset: Agrovoc
notation: 6161

yağış yüksekliği
type: Label
created: 2024-09-11T10:57:35
in dataset: Agrovoc
notation: 88897fc9

降水
type: Label
created: 2002-12-12T00:00:00Z
in dataset: Agrovoc
notation: 6161

降水量
type: Label
created: 2002-12-12T00:00:00Z
in dataset: Agrovoc
notation: 29544

prefLabel
comment: A resource has no more than one value of skos:prefLabel per language tag.