有常用名概念
comment: ع <لها مفهوم الاسم الشائع> س. ع هو مفهوم محدد علميًا لكائن حي أو مجموعة من الكائنات الحية التي تحمل اسمًا علميًا كعلامات ، ولها رتبة تصنيفية محددة على سبيل المثال"Apis mellifera". <لها مفهوم الاسم الشائع> "نحل العسل". يستخدم على مستوى المفهوم عندما يكون الاسم الشائع والاسم العلمي مفهومين منفصلين. لعلاقة التسمية إلى التسمية للاستخدام ضمن المفهوم ، استخدم <له اسم علمي / اسم علمي لـ>. @ar
comment: Y<有常用名概念>X。Y是某一生物体或生物群X的学名概念，其标签为学名，具有特定的分类等级。“Apis mellifera”<有常用名概念>“蜜蜂”。当常用名和学名是独立的概念时，在概念层面使用。对于标签间关系，在同一个概念内使用<有学名/是...的学名>。
comment: Y <имеет обиходное название> X. Y - это научно определенное понятие для организма или группы организмов с научным названием в качестве меток, имеющих определенный таксономический ранг. "Apis mellifera" <имеет обиходное название> "медоносные пчелы". Используется на уровне понятия, когда обиходное название и научное название являются отдельными понятиями. Для связи между метками в пределах понятия используйте <имеет научное название/явлется научным названием>. @ru
comment: Y <tiene nombre común del concepto> X. Y es un concepto definido científicamente para un organismo o un grupo de organismos con nombre científico como etiquetas, que tiene un rango taxonómico específico. "Apis mellifera" <tiene nombre común del concepto> "Abeja melífera". Se utiliza a nivel de concepto cuando el nombre común y el nombre científico son conceptos separados. Para la relación de etiqueta a etiqueta para su uso dentro de un concepto, utilice <tiene nombre científico / es el nombre científico de>. @es
comment: Y <has common name concept> X. Y is a scientifically defined concept for an organism or a group of organisms with scientific name as labels, having a specific taxonomic rank. "Apis mellifera” <has common name concept> “honey bees”. Use at concept level when common name and scientific name are separate concepts. For label-to-label relationship for use within a concept, use <has scientific name / scientific name of>. @en
comment: Y <a nom commun de concept> X. Y est un concept scientifiquement défini pour un organisme ou un groupe d'organismes avec des noms scientifiques comme terme, ayant un rang taxonomique spécifique. "Apis mellifera" <a nom commun de concept> "abeille domestique". Utilisation au niveau du concept lorsque le nom commun et le nom scientifique sont des concepts distincts. Pour une relation terme à terme à utiliser dans un concept, utilisez <a nom scientifique/ est le nom scientifique>. @fr
label: له مفهوم الاسم الشائع @ar
label: имеет обиходное название @ru
label: Tiene nombre común del concepto @es
label: Has common name concept @en
label: A nom commun de concept @fr
sub property of: taxonomicRelationship

有病原体
comment: س <لديه مسببات مرض> ع. الكائن الحي لديه مسببات مرض ع. مسببات الأمراض هي الكائنات الحية الدقيقة المسببة للأمراض مثل الفيروسات والبكتيريا والفطريات على سبيل المثال: "Olea europaea "<لديها مسببات مرض>" Xylella fastidiosa " @ar
comment: X<有病原体>Y。生物体X有病原体Y。病原体指病毒、细菌和真菌等致病性微生物。例如：“Olea europaea”<有病原体>“Xylella fastidiosa”。
comment: X <имеет патоген> Y. Организм X имеет патоген Y. Патогены - это патогенные микроорганизмы, такие как вирусы, бактерии и грибы. Например, "Olea europaea" <имеет патоген> "Xylella fastidiosa". @ru
comment: X <tiene patógeno> Y. El organismo X tiene el patógeno Y. Los patógenos son microorganismos patógenos como virus, bacterias y hongos. Ej. "Olea europaea" <tiene patógeno> "Xylella fastidiosa". @es
comment: X <has pathogen> Y. Organism X has pathogen Y. Pathogens are pathogenic microorganism such as viruses, bacteria and fungi. E.g. "Olea europaea" <has pathogen> "Xylella fastidiosa". @en
comment: X <a l'agent pathogène> Y. L'organisme X a un agent pathogène Y. Les agents pathogènes sont des microorganismes pathogènes tels que : des virus, des bactéries et des champignons. Par exemple, "Olea europaea" <a l'agent pathogène> "Xylella fastidiosa". @fr
label: لديه مسببات الأمراض @ar
label: имеет патоген @ru
label: Tiene patógeno @es
label: Has pathogen @en
label: A l'agent pathogène @fr
sub property of: causativeRelationship

有有害生物
comment: ع <لديه الآفة> س. الكائن الحي ع الذي تسبب فيه الآفة س الضرر. الآفات هي الحشرات والديدان الخيطية والقوارض التي تسبب الضرر. على سبيل المثال: "Apis mellifera" < لديه الآفة> "Varroa destructor", "Olea europaea" <لديه الآفة> "Bactrocera oleae". @ar
comment: У Y <имеется вредитель> X. Организм Y, которому вредитель X причиняет вред. Вредители - это насекомые, нематоды и грызуны, которые причиняют вред. Например, У "Apis mellifera" <имеется вредитель> "Varroa destructor", У "Olea europaea" <имеется вредитель> "Bactrocera oleae". @ru
comment: Y<有有害生物>X。有害生物X对生物体Y造成损害。有害生物指造成损害的昆虫、线虫和啮齿动物。例如：“西方蜜蜂”<有有害生物>“Varroa destructor”，“Olea europaea”<有有害生物>“油橄榄果实蝇”。
comment: Y <tiene plaga> X. Un organismo Y en el que la plaga X causa daños. Las plagas son insectos, nematodos y roedores que causan daños. Ej. "Apis mellifera" <tiene plaga> "Varroa destructor", "Olea europaea" <tiene plaga> "Bactrocera oleae". @es
comment: Y <has pest> X. An organism Y in which the pest X causes harm. Pests are insects, nematodes and rodents that cause damage. E.g. "Apis mellifera" <has pest> "Varroa destructor", "Olea europaea" <has pest> "Bactrocera oleae". @en
comment: Y <a peste> X. Un organisme Y dans lequel le ravageur X cause des dommages. Les ravageurs sont des insectes, des nématodes et des rongeurs qui causent des dommages. Par exemple, "Apis mellifera" <a peste> "Varroa destructor", "Olea europaea" <a peste> "Bactrocera oleae". @fr
label: لديه آفة @ar
label: У ... имеется вредитель ... @ru
label: Tiene plaga @es
label: Has pest @en
label: A peste @fr
sub property of: causativeRelationship

有分类等级
comment: س <لها مرتبة تصنيفية في> ع. تصف المرتبة التصنيفية ع الكائن الحي س. على سبيل المثال: "Spodoptera frugiperda" <لها مرتبة تصنيفية في> "الأنواع (نظام التصنيف)". @ar
comment: X<有分类等级>Y。描述了生物体X的分类等级Y。例如：“草地贪夜蛾”<有分类等级>“物种(分类单位)”。
comment: X <имеет таксономический ранг> Y. Описывает таксономический ранг Y организма X. "Spodoptera frugiperda" <имеет таксономический ранг> "вид (таксон)". @ru
comment: X <tiene el rango taxonómico> Y. Describe el rango taxonómico Y del organismo X. Ej. "Spodoptera frugiperda" <tiene el rango taxonómico> "Especie (taxón)". @es
comment: X <has taxonomic rank> Y. Describes taxonomic rank Y of organism X. “Spodoptera frugiperda” <has taxonomic rank> “species (taxa)”. @en
comment: X <a le rang taxonomique> Y. Décrit le rang taxonomique Y de l'organisme X. "Spodoptera frugiperda" <a le rang taxonomique> "espèce (taxon)" @fr
label: لديها المرتبة التصنيفية @ar
label: имеет таксономический ранг @ru
label: Tiene el rango taxonómico @es
label: Has taxonomic rank @en
label: A le rang taxonomique @fr
sub property of: taxonomicRelationship

用作
comment: X <用作> Y. 例如 : "山梨醇" <用作> "甜味剂"; "乙醇" <用作> "燃料".
comment: X <se utiliza como> Y. Ej. "Sorbitol" <se utiliza como> "Edulcorante"; "Etánol" <se utiliza como> "Combustible". @es
comment: X <is used as> Y. E.g. "sorbitol" <is used as> "sweetener"; "ethanol" <is used as> "fuel". @en
comment: X <est utilisé comme> Y. Par exemple: "sorbitol" <est utilisé comme> "édulcorant"; "éthanol" <est utilisé comme> "combustible". @fr
comment: X <مستعمل ك> Y: "سربتول" <مستعمل ك> "محليات"; "إيثانول" <مستعمل ك> "وقود". @ar
comment: X <направлен на> Y. X направлен на цель или процесс Y. Например, "ветеринарные услуги" <направлен на> "здоровье животных", "рубки обновления" <направлен на> "естественное возобновление". @ru
label: مستعمل ك @ar
label: используется как @ru
label: Se utiliza como @es
label: Is used as @en
label: Est utilisé comme @fr
sub property of: processRelationship

生产
comment: ع <ينتج> س. . على سبيل المثال: "نحل العسل" <ينتج> "العسل"، "Solanum tuberosum"<تنتج> "البطاطا". ومع ذلك ، فإن "صناعة الجبن" <لها منتج> "جبن". @ar
comment: Y<生产>X。例如：“蜜蜂”<生产>“蜂蜜”，“阳芋”<生产>“马铃薯”。但是，“奶酪制作”<有产品>“干酪”。
comment: Y <производит> X. Например, "медоносные пчелы" <производит> "мед", "Solanum tuberosum" <производит> "картофель (клубни)". Однако "сыроделие" <имеет продукт> "сыры". @ru
comment: Y <produit> X. Ex. "abeille domestique" <produit> "miel", “Solanum tuberosum” <produit> "pomme de terre". Cependant, "fabrication fromagère" <a le produit> "fromage". @fr
comment: Y <produces> X. E.g. “honey bees” <produces>“honey”, “Solanum tuberosum” <produces> "potatoes". However, “cheese-making” <has product>”cheese”. @en
comment: Y <produce> X. E.g. “Abeja melífera” <produce> “Miel”, “Solanum tuberosum” <produce> "Papa". Pero “Fabricación del queso” <tiene el producto> ”Queso”. @es
label: ينتج عنه @ar
label: производит @ru
label: Produit @fr
label: Produces @en
label: Produce @es
sub property of: causativeRelationship

AGROVOC
type: ConceptScheme

Orobanche cumana
type: Concept
pest of: 向日葵

葵花籽
type: Concept
is produced by: 向日葵
preferred label: semente de girassol @pt-br
preferred label: მზესუმზირას თესლი @ka
preferred label: mbegu ya alizeti @sw
preferred label: solsikkefrø @da
preferred label: seminţe de floarea-soarelui @ro
preferred label: насіння соняшника @uk
preferred label: ayçiçeği tohumu @tr
preferred label: Biji bunga matahari @ms
preferred label: เมล็ดทานตะวัน @th
preferred label: slnečnicové semená @sk
preferred label: подсолнечник (маслосемена) @ru
preferred label: بذور دوار الشمس @ar
preferred label: slunečnicová semena @cs
preferred label: Sonnenblumenkerne @de
preferred label: sunflower seed @en
preferred label: Semilla de girasol @es
preferred label: بذر آفتابگردان @fa
preferred label: graine de tournesol @fr
preferred label: सूरजमुखी बीज @hi
preferred label: napraforgómag @hu
preferred label: Seme di girasole @it
preferred label: ヒマワリ種子 @ja
preferred label: 해바라기씨 @ko
preferred label: ເມັດດອດຕາເວັນ @lo
preferred label: Słonecznik (nasiona) @pl

泡盛曲霉
type: Concept
is pathogen of: 向日葵
preferred label: Aspergillus awamori @vi
preferred label: آسپرژیلوس آواموری @fa
preferred label: ऐस्पर्जिलस आवामोरी @hi
preferred label: アワモリコウジカビ @ja

黄曲霉
type: Concept
is pathogen of: 向日葵
preferred label: Aspergillus flavus @ca
preferred label: آسپرژیلوس فلاووس @fa
preferred label: ऐस्पर्जिलस फ्लेबस @hi
preferred label: アスペルギルス フラウス @ja

灰葡萄孢
type: Concept
is pathogen of: 向日葵
preferred label: Botrytis cinerea @be
preferred label: عنقودية رمادية @ar
preferred label: بوتریتیس سینرئا @fa
preferred label: बॉट्राइटिस साइनेरिया @hi
preferred label: ボトリチス シネレア @ja
preferred label: 잿빛곰팡이병균 @ko

二孢白粉菌
type: Concept
is pathogen of: 向日葵
preferred label: Erysiphe cichoracearum @vi
preferred label: اریزیفه سیکوراسئاروم @fa
preferred label: इरिसाइफी सिकोरेसियेरम @hi
preferred label: エリシフェ チコラセアルム @ja
preferred label: 가지흰가루병균 @ko

蓼白粉菌
type: Concept
is pathogen of: 向日葵
preferred label: Erysiphe polygoni @vi
preferred label: اریزیفه پلی‌گونی @fa
preferred label: इरिसाइफी पालीगोनी @hi
preferred label: エリシフェ ポリゴニ @ja
preferred label: 배추흰가루병균 @ko

小核盘菌
type: Concept
is pathogen of: 向日葵
preferred label: Sclerotinia minor @be
preferred label: اسکلروتینیا مینور @fa
preferred label: स्क्लेरोटिनिया माइनर @hi
preferred label: スクレロチニア ミノル @ja

核盘菌
type: Concept
is pathogen of: 向日葵
preferred label: Sclerotinia sclerotiorum @be
preferred label: اسکلروتینیا اسکلروتیوروم @fa
preferred label: स्क्लेरोटिनिया स्क्लेरोटिओरम @hi
preferred label: スクレロチニア スクレロチオルム @ja
preferred label: 균핵병균 @ko

物种(分类单位)
type: Concept
is taxonomic rank of: 向日葵
preferred label: Espècie (tàxon) @ca
preferred label: spishi (taxa) @sw
preferred label: від (таксон) @be
preferred label: الأنواع (التصنيف) @ar
preferred label: specie (taxon) @ro
preferred label: вид (таксони) @uk
preferred label: species (taxa) @en
preferred label: druh (taxon) @cs
preferred label: Art (Taxon) @de
preferred label: Specie (taxa) @it
preferred label: Especie (taxón) @es
preferred label: జాతి (వర్గీకరణ ) @te
preferred label: espèce (taxon) @fr
preferred label: espécie (táxon) @pt
preferred label: tür (takson) @tr
preferred label: სახეობა (ტაქსონი) @ka
preferred label: вид (таксон) @ru
preferred label: lajit @fi
preferred label: arter @sv

向日葵链格孢
type: Concept
is pathogen of: 向日葵
preferred label: Alternaria helianthi @be
preferred label: آلترناریا هلیانتی @fa
preferred label: आल्टर्नेरिया हिलैन्थी @hi
preferred label: アルテルナリア ヘリアンティ @ja

向日葵属
type: Concept
narrower: 向日葵
preferred label: Helianthus @be
preferred label: عباد الشمس @ar
preferred label: هلیانتوس @fa
preferred label: हेलीएन्थस @hi
preferred label: ヒマワリ属 @ja
preferred label: 해바라기속 @ko

向日葵
type: Concept
有常用名概念: solsikker
有病原体: Podosphaera fuliginea
有病原体: Podosphaera fusca
有病原体: Leveillula taurica
有病原体: Alternaria helianthicola
有病原体: Golovinomyces orontii
有病原体: 向日葵链格孢
有病原体: 核盘菌
有病原体: 小核盘菌
有病原体: 灰葡萄孢
有病原体: 黄曲霉
有病原体: 泡盛曲霉
有病原体: 蓼白粉菌
有病原体: 二孢白粉菌
有有害生物: Orobanche cumana
有分类等级: 物种(分类单位)
用作: 一次结实观赏植物
用作: 油料作物
生产: 葵花籽
created: 2011-11-20T20:39:37Z
modified: 2024-01-24T17:58:42Z
in dataset: Agrovoc
alternative label: сланечнік аднагадовы @be
broader: 向日葵属
in scheme: AGROVOC
preferred label: Helianthus annuus @vi
preferred label: عباد الشمس السنوي @ar
preferred label: هلیانتوس آنوئوس @fa
preferred label: हेलीएन्थस एनस (सूरज मुखी) @hi
preferred label: ヒマワリ @ja
preferred label: 해바라기 @ko
alt label: сланечнік аднагадовы
pref label: Helianthus annuus
pref label: 向日葵
pref label: 해바라기
pref label: ヒマワリ
pref label: हेलीएन्थस एनस (सूरज मुखी)
pref label: هلیانتوس آنوئوس
pref label: عباد الشمس السنوي

Podosphaera fuliginea
type: Concept
is pathogen of: 向日葵

油料作物
type: Concept
is use of: 向日葵
preferred label: Planta oleaginosa @es
preferred label: алейныя культуры @be
preferred label: mimea ya mafuta @sw
preferred label: олійні культури @uk
preferred label: culturi oleaginoase @ro
preferred label: నూనె పంటలు @te
preferred label: yağ bitkisi @tr
preferred label: พืชน้ำมัน @th
preferred label: olejniny @sk
preferred label: масличные культуры @ru
preferred label: محاصيل زيتيه @ar
preferred label: Ölpflanze @de
preferred label: oil crops @en
preferred label: محصولات زراعی روغنی @fa
preferred label: plante oléagineuse @fr
preferred label: तिलहन फसलें @hi
preferred label: olajnövény @hu
preferred label: Colture oleaginose @it
preferred label: 유료작물 @ko
preferred label: ພືດນ້ຳມັນ @lo
preferred label: Roślina oleista @pl
preferred label: planta oleaginosa @pt

一次结实观赏植物
type: Concept
is use of: 向日葵
preferred label: Monocarpo ornamental @es
preferred label: monocarp za mapambo @sw
preferred label: monokarpik süs bitkisi @tr
preferred label: plante ornamentale monocarpe @ro
preferred label: მონოკარპული დეკორატიული მცენარე @ka
preferred label: ไม้ประดับประเภทออกผลครั้งเดียว @th
preferred label: okrasné monokarpické rastliny @sk
preferred label: декоративные монокарпики @ru
preferred label: نبات زينة وحيد الإثمار @ar
preferred label: okrasné letničky a dvouletky @cs
preferred label: monokarpe Zierpflanze @de
preferred label: ornamental monocarps @en
preferred label: تک‌باره‌های زینتی @fa
preferred label: plante ornementale monocarpique @fr
preferred label: शोभाकारी / सजावटी एक पुष्पीय @hi
preferred label: egynyári dísznövény @hu
preferred label: Piante ornamentali monocarpiche @it
preferred label: 一回結実性観賞植物 @ja
preferred label: 관상용일이년초 @ko
preferred label: ໄມ້ປະດັບມີໝາກຄັ້ງດຽວ @lo
preferred label: Roślina ozdobna monokarpiczna @pl
preferred label: planta ornamental monocárpica @pt

Golovinomyces orontii
type: Concept
is pathogen of: 向日葵

Alternaria helianthicola
type: Concept
is pathogen of: 向日葵

solsikker
type: Concept
has taxonomic concept: 向日葵
preferred label: сланечнік @be
preferred label: alizeti @sw
preferred label: მზესუმზირა @ka
preferred label: ηλίανθος @el
preferred label: auringonkukka @fi
preferred label: päevalill @et
preferred label: solros @sv
preferred label: solsikke @da
preferred label: zonnebloem @nl
preferred label: floarea-soarelui @ro
preferred label: Сунцокрет @sr
preferred label: ayçiçeği @tr
preferred label: Sonnenblume @de
preferred label: عباد الشمس @ar
preferred label: جنس آفتابگردان @fa
preferred label: सूरजमुखी @hi
preferred label: ทานตะวัน @th
preferred label: slunečnice roční @cs
preferred label: slnečnice (rastlina) @sk
preferred label: Girasoli @it
preferred label: napraforgó @hu
preferred label: girassol @pt
preferred label: Słonecznik zwyczajny @pl
preferred label: tournesol @fr
preferred label: sunflowers @en
preferred label: подсолнечник @ru
preferred label: Girasol @es

Podosphaera fusca
type: Concept
is pathogen of: 向日葵

Leveillula taurica
type: Concept
is pathogen of: 向日葵

عباد الشمس السنوي
type: Label
has term type: Taxonomic terms for plants
created: 2002-12-12T00:00:00Z
in dataset: Agrovoc
notation: 3539

сланечнік аднагадовы
type: Label
created: 2023-12-01T08:15:48
in dataset: Agrovoc
notation: 968c6547

Helianthus annuus
type: Label
created: 2023-12-14T11:06:46
in dataset: Agrovoc
notation: 3539

Helianthus annuus
type: Label
has term type: Taxonomic terms for plants
scientific name of: xl cs 1299497206052
created: 2003-03-27T00:00:00Z
in dataset: Agrovoc
notation: 3539

Helianthus annuus
type: Label
created: 2024-01-24T16:40:42Z
in dataset: Agrovoc
notation: 3539

Helianthus annuus
type: Label
has term type: Taxonomic terms for plants
scientific name of: xl de 1299497207234
created: 1996-12-24T00:00:00Z
in dataset: Agrovoc
notation: 3539

Helianthus annuus
type: Label
has term type: Taxonomic terms for plants
scientific name of: xl en 1299497206952
created: 1981-01-09T00:00:00Z
in dataset: Agrovoc
notation: 3539

Helianthus annuus
type: Label
has related term: xl es 1299497207760
has related term: xl es 1299497207652
has related term: xl es 1299497207547
has term type: Taxonomic terms for plants
scientific name of: xl es 1299497207090
created: 1981-01-23T00:00:00Z
in dataset: Agrovoc
notation: 3539

هلیانتوس آنوئوس
type: Label
has related term: xl fa 1299497207851
has term type: Taxonomic terms for plants
scientific name of: xl fa 1299497205889
created: 2007-04-20T00:00:00Z
in dataset: Agrovoc
notation: 3539

Helianthus annuus
type: Label
has related term: xl fr 1299497207435
has related term: xl fr 1299497207331
has term type: Taxonomic terms for plants
scientific name of: xl fr 1299497206591
created: 1981-01-21T00:00:00Z
in dataset: Agrovoc
notation: 3539

हेलीएन्थस एनस (सूरज मुखी)
type: Label
has term type: Taxonomic terms for plants
scientific name of: xl hi 1299497205943
created: 1981-01-09T00:00:00Z
in dataset: Agrovoc
notation: 3539

Helianthus annuus
type: Label
has term type: Taxonomic terms for plants
scientific name of: xl hu 1299497206254
created: 2006-12-06T00:00:00Z
in dataset: Agrovoc
notation: 3539

Helianthus annuus
type: Label
has term type: Taxonomic terms for plants
scientific name of: xl it 1299497206171
created: 2006-11-06T00:00:00Z
in dataset: Agrovoc
notation: 3539

ヒマワリ
type: Label
has term type: Taxonomic terms for plants
created: 2005-08-09T00:00:00Z
in dataset: Agrovoc
notation: 3539

Helianthus annuus
type: Label
created: 2019-03-25T15:41:00.021+01:00
in dataset: Agrovoc
notation: 3539

해바라기
type: Label
has term type: Taxonomic terms for plants
created: 2009-12-02T00:00:00Z
in dataset: Agrovoc
notation: 3539

Helianthus annuus
type: Label
created: 2019-02-12T12:52:32.021+01:00
in dataset: Agrovoc
notation: 3539

Helianthus annuus
type: Label
has term type: Taxonomic terms for plants
created: 2005-12-16T00:00:00Z
in dataset: Agrovoc
notation: 3539

Helianthus annuus
type: Label
created: 2024-01-22T17:21:42Z
in dataset: Agrovoc
notation: 3539

Helianthus annuus
type: Label
created: 2024-01-24T17:10:42Z
in dataset: Agrovoc
notation: 3539

Helianthus annuus
type: Label
has term type: Taxonomic terms for plants
scientific name of: xl pl 1299497206529
created: 2006-12-19T00:00:00Z
in dataset: Agrovoc
notation: 3539

Helianthus annuus
type: Label
created: 2021-09-30T08:50:42Z
in dataset: Agrovoc
notation: 3539

Helianthus annuus
type: Label
has term type: Taxonomic terms for plants
scientific name of: xl pt 1299497206315
created: 1998-08-04T00:00:00Z
in dataset: Agrovoc
notation: 3539

Helianthus annuus
type: Label
created: 2019-05-31T12:20:00.021+01:00
in dataset: Agrovoc
notation: 3539

Helianthus annuus
type: Label
has term type: Taxonomic terms for plants
scientific name of: xl ru 1299497207023
created: 2009-07-20T00:00:00Z
in dataset: Agrovoc
notation: 3539

Helianthus annuus
type: Label
has term type: Taxonomic terms for plants
scientific name of: xl sk 1299497206110
created: 2005-12-16T00:00:00Z
in dataset: Agrovoc
notation: 3539

Helianthus annuus
type: Label
created: 2020-01-17T09:37:26.811+01:00
in dataset: Agrovoc
notation: 3539

Helianthus annuus
type: Label
created: 2024-01-24T17:44:42Z
in dataset: Agrovoc
notation: 3539

Helianthus annuus
type: Label
created: 2021-07-05T19:30:42Z
in dataset: Agrovoc
notation: 3539

Helianthus annuus
type: Label
has term type: Taxonomic terms for plants
scientific name of: xl th 1299497205998
created: 2005-08-19T00:00:00Z
in dataset: Agrovoc
notation: 3539

Helianthus annuus
type: Label
created: 2011-11-20T20:13:07Z
modified: 2011-11-20T20:13:07Z
in dataset: Agrovoc
notation: 3539

Helianthus annuus
type: Label
created: 2019-03-25T15:48:00.021+01:00
in dataset: Agrovoc
notation: 3539

Helianthus annuus
type: Label
created: 2024-01-24T17:58:42Z
in dataset: Agrovoc
notation: 3539

向日葵
type: Label
has term type: Taxonomic terms for plants
created: 2002-12-12T00:00:00Z
in dataset: Agrovoc
notation: 3539

prefLabel
comment: A resource has no more than one value of skos:prefLabel per language tag. @en